program: Gaussian 09
title: 000170766
version: EM64L-G09RevD.01
frameworkgroup: C1[X(C12H18O)]
method: RPBEPBE
basis: SDD
operation: Freq
keyword: #pfreq=noraman
keyword: PBEPBE/SDD
title: #p freq=noraman PBEPBE/SDD
converged: NO YES NO NO
title: Mulliken charges:
elementType: O C C C C C C C C C C C C H H H H H H H H H H H H H H H H H H
charge: -0.453981 0.182330 0.329071 -0.752017 -0.729921 -0.729717 0.020700 -0.388575 0.133460 0.381100 -0.504538 -0.907869 -0.848205 0.215732 0.214645 0.214519 0.209821 0.199390 0.262246 0.199414 0.209872 0.262043 0.251568 0.225831 0.235824 0.236038 0.272580 0.227781 0.227862 0.235432 0.367565
chargesum: 0.00000
title: Mulliken charges with hydrogens summed into heavy atoms:
elementType: O C C C C C C C C C C C C
charge: -0.086416 0.182330 0.329071 -0.107121 -0.058464 -0.058388 0.020700 -0.137007 0.133460 0.381100 -0.278707 -0.163427 -0.157130
polarizability: 1.71570993e+02 -7.76897870e-01 1.39923057e+02 -2.89746780e-03 -1.15397778e-02 8.83818952e+01
1716.lowfreq: -14.4233 -8.6789 -0.0011 -0.0010 -0.0009 10.1539 70.5810 79.2103 127.2049
frequency: 70.2732 79.0796 127.2012 147.9372 178.2916 193.1758 201.4039 242.0998 254.2987 257.4800 275.7476 302.3081 310.7222 322.4117 332.3490 350.5601 356.3066 400.3753 426.4559 483.7324 503.2767 541.6087 546.6746 607.0083 620.9304 686.3621 750.0326 808.0567 817.1681 850.3769 923.4559 927.8827 937.4907 945.4339 948.6668 997.8458 1023.1314 1027.2632 1030.7793 1049.3810 1072.6270 1136.2968 1170.0916 1194.4269 1204.2348 1218.4166 1258.1590 1271.1888 1283.6291 1367.9074 1373.4071 1380.3073 1392.8892 1394.5127 1400.9712 1407.6309 1455.3283 1460.3550 1469.9377 1471.4292 1476.1839 1478.0610 1484.0498 1489.8656 1497.1134 1503.7609 1507.0903 1586.2214 1618.9468 2944.6479 2969.9231 2970.5355 2973.7544 2978.3327 3008.0122 3043.9145 3060.1762 3063.3863 3068.9545 3072.4679 3081.5177 3105.3292 3105.9041 3108.7203 3128.7824 3171.9255 3576.0686
redmass: 2.8810 3.1223 1.3710 1.8012 1.0776 3.0895 1.1580 1.9745 1.0816 2.5348 3.0047 1.3426 2.6737 1.0798 2.8774 3.6653 2.4495 2.6075 3.0172 4.3189 3.4010 3.9704 3.1461 3.4313 4.8034 4.7577 4.7000 3.4343 1.3200 2.5397 1.7390 2.1471 1.8638 1.2166 1.3275 1.4338 1.3826 1.4285 1.3792 1.5935 2.1530 2.0386 1.4977 3.3674 2.9575 2.2390 2.1248 2.1200 2.6470 1.1839 1.3895 2.6932 2.2431 1.3421 1.2040 1.6200 1.0485 1.2348 1.0461 1.0660 1.0481 1.0622 1.2326 1.0508 1.0437 1.2994 1.4395 5.9164 6.9379 1.0424 1.0379 1.0354 1.0363 1.0371 1.0979 1.0976 1.1000 1.0992 1.0998 1.0982 1.0975 1.0985 1.0908 1.0978 1.0890 1.0927 1.0649
irintensity: 0.2032 0.7260 0.7061 0.1456 0.2504 1.3303 0.6950 1.7701 0.1482 20.5882 0.2339 86.9762 1.2569 3.2884 0.4923 2.6662 1.0683 1.0800 0.0508 1.4953 0.0485 0.0837 9.1293 3.4343 1.2891 11.6472 3.5089 1.1534 28.6075 4.5698 1.7857 2.3011 14.0006 0.4581 0.3441 10.9259 3.6743 8.3453 0.1455 1.4234 44.0546 89.8923 69.3830 18.0227 7.8698 4.6634 8.5470 15.4171 35.5548 24.2512 17.9328 1.4893 57.1715 7.7395 26.2824 14.8529 0.1325 13.5552 23.5863 2.6028 0.0336 10.8701 6.0466 10.6656 1.1899 0.3441 45.4915 5.3225 8.2667 38.0282 45.6524 23.0522 45.0471 51.3243 21.9772 22.8548 7.7008 13.0147 51.5887 105.5395 21.9858 1.0136 12.5952 23.4512 16.4308 14.2271 23.7216
temp: 298.150 k
press: 1.00000 atm
elementType: 8 6 6 6 6 6 6 6 6 6 6 6 6 1 1 1 1 1 1 1 1 1 1 1 1 1 1 1 1 1 1
symmnumber: 1
zpe: 701684.1 jmol-1
zpe.correction: 0.267257 hartree
zpe.thermalcorrener: 0.281782 hartree
zpe.thermalcorrenthalpy: 0.282726 hartree
zpe.thermalcorrgfe: 0.227887 hartree
zpe.sumelectzpe: -542.300929 hartree
zpe.sumelectthermal: -542.286405 hartree
zpe.sumelectthermalent: -542.285461 hartree
zpe.sumelectthermalfe: -542.340299 hartree
dipole: 2.0702 0.8633 -0.0056
dipole: 2.2430
quadrupole: -73.8482 -73.6154 -83.8233
quadrupole: 4.5696 -0.0052 -0.0231
quadrupole: 3.2474 3.4802 -6.7277 4.5696 -0.0052 -0.0231
hfenergy: -542.5681867 hartree
pointgroup: C01 [X(C12H18O1)]
dipole: 0.8056527 -0.3600423 -0.0030499 debye
polarizability: 171.5874586|-0.0203151|139.9038491|-0.463388|0.0922351|88.384638 unknown
InChI: InChI=1S/C12H18O/c1-8-6-7-10(12(3,4)5)11(13)9(8)2/h6-7,13H,1-5H3
charge 0 multiplicity 1
31 atoms
O  -0.355558 -2.094518 -0.001326
C  -2.216171 0.148589 0.013781
C  -0.676547 0.315522 0.00568
C  -2.943929 1.519888 0.022726
C  -2.660463 -0.630536 1.289551
C  -2.674999 -0.621186 -1.262432
C  0.214993 -0.797953 -0.001546
C  -0.059676 1.589808 0.004629
C  1.633334 -0.665776 -0.009538
C  2.209329 0.636015 -0.009849
C  1.34207 1.752631 -0.002772
C  2.486586 -1.927125 -0.017393
C  3.715634 0.847666 -0.017878
H  -4.035897 1.347547 0.028377
H  -2.695877 2.115214 0.921247
H  -2.706383 2.121253 -0.874606
H  -2.36974 -0.079612 2.203469
H  -3.761054 -0.746964 1.293665
H  -2.202784 -1.631602 1.322681
H  -3.775729 -0.736769 -1.255568
H  -2.393865 -0.063866 -2.175466
H  -2.218806 -1.622461 -1.307855
H  -0.685947 2.485624 0.009692
H  1.767119 2.762878 -0.00304
H  2.311979 -2.55586 0.880819
H  2.298124 -2.55387 -0.914122
H  3.560054 -1.686676 -0.025314
H  4.203072 0.39734 0.868034
H  4.192418 0.404805 -0.913346
H  3.954376 1.924629 -0.014818
H  0.354739 -2.782735 -0.002181
