program: Gaussian 09
title: 000160207
version: EM64L-G09RevD.01
frameworkgroup: C1[X(C6H9NO6)]
method: RPBEPBE
basis: SDD
operation: Freq
keyword: #pfreq=noraman
keyword: PBEPBE/SDD
title: #p freq=noraman PBEPBE/SDD
converged: NO NO NO NO
title: Mulliken charges:
elementType: O O O O O O N C C C C C C H H H H H H H H H
charge: -0.418220 -0.428132 -0.468545 -0.268367 -0.441696 -0.207721 -0.377919 -0.111367 -0.089777 -0.170561 -0.178167 0.093738 0.181770 0.241166 0.235430 0.288067 0.246922 0.354697 0.370996 0.367433 0.376689 0.403564
chargesum: 0.00000
title: Mulliken charges with hydrogens summed into heavy atoms:
elementType: O O O O O O N C C C C C C
charge: -0.047224 -0.060699 -0.091856 -0.268367 -0.038132 -0.207721 -0.023222 0.129800 0.145653 0.117506 0.068755 0.093738 0.181770
polarizability: 1.12305849e+02 -4.27151015e+00 9.72809763e+01 1.56027210e+00 2.98826123e-01 5.77036764e+01
1716.lowfreq: -6.0277 0.0001 0.0007 0.0007 6.6299 7.4565 49.6029 53.6535 91.9114
frequency: 49.5866 53.6249 91.9059 108.2174 176.5508 238.4317 259.2471 278.8412 290.7253 319.3030 361.1000 386.4070 397.6087 422.8625 438.8208 444.7073 454.6995 470.8307 561.9484 586.8963 605.7380 639.9450 668.7159 693.5178 735.2376 870.4562 883.4103 969.2738 995.1323 1007.1603 1033.5605 1065.5994 1076.7443 1083.0051 1141.2570 1182.2455 1217.6173 1233.0549 1253.4206 1279.8122 1286.2115 1295.1005 1300.4067 1327.4423 1353.8951 1367.1281 1390.1787 1417.8098 1433.8406 1630.1631 1668.9284 2935.1990 2935.6680 2971.2378 2990.0855 3456.5313 3498.0716 3509.3417 3534.0817 3540.7206
redmass: 8.2239 9.7766 7.2098 8.7093 6.4948 4.8049 4.7212 5.6099 5.2117 5.4569 5.5671 4.3470 3.5269 1.2260 2.3461 1.6765 1.5740 2.5580 3.1205 2.7733 1.5673 4.7344 2.9319 1.6150 4.5961 6.3893 5.1643 4.9751 5.0496 5.4259 2.5780 3.9826 2.8156 2.6778 1.9989 1.5160 1.2235 1.3334 1.3556 1.1465 1.2619 1.5945 1.2372 1.3567 1.4113 1.7071 2.8281 1.5679 1.9772 6.3274 9.3577 1.0803 1.0804 1.0835 1.0861 1.0648 1.0761 1.0645 1.0651 1.0655
irintensity: 0.6809 2.4938 4.4317 1.8340 6.8505 10.3549 4.7090 16.6573 4.4059 17.1339 7.2425 22.6808 76.0141 47.9027 131.6564 24.9701 127.3455 74.2194 40.0574 22.3166 113.7991 16.3417 65.1507 141.4254 15.6408 24.8720 29.8728 67.5550 50.2362 88.1677 55.3348 139.5304 79.2124 199.4330 7.9791 20.5575 26.9012 39.5516 28.5765 32.3341 8.3584 43.9633 39.7136 56.8684 9.0175 25.5476 27.8754 8.9344 9.0348 367.5611 223.0812 14.8522 18.4464 6.5799 72.0022 41.0659 47.0512 50.6591 28.2516 24.3557
temp: 298.150 k
press: 1.00000 atm
elementType: 8 8 8 8 8 8 7 6 6 6 6 6 6 1 1 1 1 1 1 1 1 1
symmnumber: 1
zpe: 423892.3 jmol-1
zpe.correction: 0.161452 hartree
zpe.thermalcorrener: 0.174104 hartree
zpe.thermalcorrenthalpy: 0.175048 hartree
zpe.thermalcorrgfe: 0.122392 hartree
zpe.sumelectzpe: -739.116369 hartree
zpe.sumelectthermal: -739.103717 hartree
zpe.sumelectthermalent: -739.102773 hartree
zpe.sumelectthermalfe: -739.155429 hartree
dipole: -4.3507 0.1223 -0.1523
dipole: 4.3551
quadrupole: -65.3371 -94.2646 -73.8055
quadrupole: -2.0155 0.7979 -2.6366
quadrupole: 12.4653 -16.4622 3.9969 -2.0155 0.7979 -2.6366
hfenergy: -739.2778211 hartree
pointgroup: C01 [X(C6H9N1O6)]
dipole: 1.7132029 -0.0256077 -0.0106839 debye
dipolederiv: -0.4439329 0.1801896 -0.1668561 0.189952 -0.7538237 -0.0410725 -0.1581563 0.0166087 -0.4430352 -0.3720818 -0.2613166 -0.12204 -0.2627578 -0.7850995 0.0021397 -0.150966 -0.0322699 -0.5109026 -0.8206776 0.0800251 0.0148591 -0.011415 -0.3107521 -0.0219689 -0.0037361 -0.0212617 -0.5331189 -0.9402637 0.2006253 -0.0573469 0.46461 -0.9224416 -0.0260986 -0.0390989 -0.0818599 -0.3804605 -0.7871988 0.4728367 -0.0135161 0.4198368 -0.8737754 -0.0428689 0.0259627 -0.0879558 -0.3863617 -0.6764409 -0.2248169 0.085785 -0.0378022 -0.9244573 0.0715395 0.144974 0.1672097 -0.3314914 -1.2069809 0.3005777 -0.0889867 -0.0189831 -0.3564629 0.0094188 -0.085689 -0.0209992 -0.4163942 0.3001436 -0.1909248 0.0938936 -0.0091767 0.6064639 -0.04783 0.1096456 0.0283345 0.3548998 0.2957827 0.2138809 0.0647528 0.1910228 0.547215 0.0864096 0.0543825 0.0395311 0.3673497 0.1123813 -0.2830373 0.1038766 -0.4569298 0.0973676 -0.0356224 0.1367832 -0.0112069 0.221063 0.5178083 -0.0614617 -0.1129133 -0.193788 -0.149356 -0.0801802 -0.1125828 -0.10498 0.3361777 1.5785346 -0.3845894 0.2186647 -0.3411844 0.8933463 0.1448949 0.2565419 0.1840406 0.2440511 1.2591057 -0.0673584 -0.2433255 -0.187527 1.4545172 -0.1129064 -0.3440277 -0.1750953 0.2845879 0.034287 -0.0022531 0.0159856 0.0192882 -0.0020755 0.0403991 0.0021523 0.0328147 -0.1563958 0.0242229 -0.0060985 0.0129347 -0.0199132 -0.0058893 -0.0372107 -0.0104429 -0.0488822 -0.1614119 -0.0198725 0.0435845 -0.0066975 0.1017216 0.0469471 0.0397528 -0.0721552 0.027699 -0.0438323 -0.03208 -0.0112096 0.0545564 -0.0071902 0.0322055 -0.0115357 0.0827401 0.0221482 -0.1237347 0.2016065 0.002795 -0.0484771 0.0604213 0.1486303 -0.0039508 -0.0653572 -0.0032504 0.3186337 0.1921056 0.024998 0.0664835 0.0075267 0.4330542 0.0377164 0.0674914 0.0510039 0.2914537 0.115563 0.0537814 0.0478029 0.079479 0.383891 -0.0428073 0.0573532 -0.0545106 0.334273 0.4321169 0.000179 0.021581 0.1501319 0.1910692 0.0202543 0.0355726 0.0290491 0.3583964 0.2358712 -0.0804067 0.0589833 -0.1373227 0.2494262 0.0515273 0.0686127 0.0438325 0.376253 unknown
polarizability: 112.4593244|-4.0625275|97.1759813|-0.0050389|-0.149224|57.6551962 unknown
InChI: InChI=1S/C6H9NO6/c8-2-1(6(12)13)7-5(11)4(10)3(2)9/h1-4,7-10,12H
charge 0 multiplicity 1
22 atoms
O  1.027112 -2.227783 0.604112
O  -1.61001 -2.391491 -0.477909
O  -3.218653 -0.033144 -0.113197
O  -1.97023 2.40933 0.119337
O  3.18245 -0.596306 -0.09866
O  2.808379 1.688869 -0.301046
N  0.128914 1.409058 0.300002
C  0.403631 -1.110445 -0.083795
C  -1.107979 -1.185366 0.172313
C  0.980659 0.225825 0.50738
C  -1.801201 0.044896 -0.433742
C  -1.223081 1.386082 0.043428
C  2.384297 0.552452 -0.015202
H  0.580498 -1.15221 -1.179456
H  -1.299815 -1.211444 1.26699
H  1.095665 0.01902 1.595989
H  -1.665651 0.005465 -1.538529
H  0.560815 2.32563 0.462274
H  1.986617 -2.247647 0.349276
H  -2.6003 -2.36773 -0.40483
H  -3.548546 0.904652 -0.025983
H  4.099228 -0.356013 -0.404454
