program: Gaussian 09
title: 000170754
version: EM64L-G09RevD.01
frameworkgroup: C1[X(C13H26O2)]
method: RPBEPBE
basis: SDD
operation: Freq
keyword: #pfreq=noraman
keyword: PBEPBE/SDD
title: #p freq=noraman PBEPBE/SDD
converged: YES YES NO NO
title: Mulliken charges:
elementType: O O C C C C C C C C C C C C C H H H H H H H H H H H H H H H H H H H H H H H H H H
charge: -0.420385 -0.236774 -0.398304 -0.375327 -0.434309 -0.387882 -0.109151 -0.381421 -0.372771 -0.405826 -0.353507 -0.356455 0.137396 -0.712823 -0.696761 0.211156 0.219925 0.191058 0.192314 0.209841 0.226649 0.193545 0.195818 0.235955 0.191526 0.191843 0.189757 0.190243 0.234910 0.200076 0.187501 0.187563 0.195022 0.194890 0.204260 0.217481 0.236689 0.209515 0.209634 0.215089 0.372039
chargesum: 0.00000
title: Mulliken charges with hydrogens summed into heavy atoms:
elementType: O O C C C C C C C C C C C C C
charge: -0.048346 -0.236774 0.032777 0.008046 0.002181 0.001481 0.126804 0.001949 0.007229 0.029161 0.021556 0.033457 0.137396 -0.054393 -0.062523
polarizability: 1.79693474e+02 8.39942187e-01 1.33018811e+02 -1.19309391e+00 -1.16304410e+00 1.30944678e+02
1716.lowfreq: -4.5337 -0.0012 -0.0010 -0.0004 5.6442 11.7634 22.4928 33.5389 37.6472
frequency: 22.3665 33.4023 37.3437 42.0243 54.1059 79.7822 84.6523 96.1898 100.1277 122.5449 142.0095 148.3145 154.3736 193.7389 203.1511 227.7956 238.7068 259.1411 287.6652 326.9755 357.9351 441.9151 453.2049 468.8577 516.8164 571.9690 631.1294 716.8697 720.5403 724.2836 733.5385 748.2149 765.5134 808.1644 828.2781 868.1850 887.5830 903.5208 951.8700 957.3180 988.3834 1011.3270 1018.2205 1032.3344 1037.7671 1045.5956 1059.0435 1069.8437 1079.2277 1080.1208 1093.0944 1120.8896 1126.4113 1165.4934 1187.0172 1202.5365 1219.6085 1230.4941 1240.6090 1254.8267 1260.7588 1269.0567 1278.5658 1281.0598 1289.7135 1291.6327 1294.9007 1301.8928 1319.1513 1337.0673 1348.1182 1354.5035 1356.6024 1360.7554 1375.1390 1389.2855 1390.5132 1459.8103 1460.6802 1461.6843 1464.0920 1464.8337 1468.4555 1474.5491 1476.0564 1477.0131 1481.2977 1486.4692 1487.3575 1489.2023 1657.5071 2948.3353 2949.2670 2950.4127 2954.3323 2960.9996 2967.4998 2969.9913 2971.4389 2976.7050 2977.8124 2982.2709 2987.0603 2988.5480 2995.1806 3001.9728 3007.6291 3018.3523 3027.8524 3038.6775 3047.8433 3050.4195 3067.9932 3069.7329 3074.5351 3082.1804 3506.7677
redmass: 4.0967 5.0161 3.5183 1.9565 3.8546 1.7166 2.5719 2.9529 2.8478 1.8063 2.4171 2.7624 2.0924 1.6367 3.4141 1.1405 2.0660 2.5404 2.4668 3.3865 3.0907 3.2706 3.5303 2.9592 2.8251 2.9860 1.4162 2.8777 1.0861 1.1037 1.1809 1.6886 1.2528 1.2710 1.6573 1.5002 1.8951 1.6090 1.7207 1.5655 4.5187 1.2151 3.5531 2.3701 2.6036 2.7520 1.6020 2.3909 2.3068 2.0923 2.0514 2.6960 2.0429 2.0109 1.7095 1.3174 1.4256 1.3484 1.4874 1.3190 1.3111 1.2893 1.1108 1.1085 1.1501 1.1711 1.1354 1.1369 1.3272 1.4222 1.4789 1.6874 1.6216 1.5520 1.6075 1.2176 1.2293 1.0752 1.0734 1.0733 1.0785 1.0633 1.0804 1.0746 1.0542 1.0466 1.0839 1.0854 1.0548 1.0941 8.1854 1.0587 1.0588 1.0591 1.0594 1.0590 1.0589 1.0601 1.0365 1.0376 1.0585 1.0963 1.0967 1.0639 1.1003 1.0830 1.1021 1.1026 1.1042 1.1046 1.0985 1.1038 1.1006 1.0992 1.0992 1.1005 1.0639
irintensity: 0.0120 0.8010 0.3685 0.1985 0.2398 0.0418 0.0612 0.0798 0.1220 0.0210 0.0112 0.0435 0.0043 0.8840 0.1217 0.0060 0.2622 0.8366 1.8310 0.7973 0.1628 3.2646 13.7363 2.9970 17.6163 27.0606 103.5321 24.4818 13.4084 1.5202 10.0315 9.6605 2.6133 1.0915 3.7214 3.9023 4.8210 9.9563 1.8165 18.8741 0.2520 19.3738 0.6739 183.6097 2.6964 41.9806 4.1084 3.1038 2.1087 0.5014 27.9723 8.9000 4.5350 8.3695 1.1575 7.4391 2.0167 7.0637 1.0772 0.9828 3.3393 8.3430 0.0639 0.8508 0.7896 1.8117 0.8920 1.4760 0.6820 2.2788 1.5101 0.2928 1.0323 4.6611 14.2021 11.2247 15.2518 1.0273 0.4934 6.2512 2.0947 0.2834 0.0071 1.1506 16.5923 8.1768 1.8847 5.4683 11.5037 30.3955 178.6353 1.3481 0.0258 3.0781 0.0353 45.4654 127.0838 18.9234 37.9732 50.1001 67.4917 0.4243 1.8350 24.0403 0.3037 22.9006 1.0795 0.5038 1.2598 99.5824 13.3710 135.9773 97.5189 55.0281 51.2478 45.0732 18.6539
temp: 298.150 k
press: 1.00000 atm
elementType: 8 8 6 6 6 6 6 6 6 6 6 6 6 6 6 1 1 1 1 1 1 1 1 1 1 1 1 1 1 1 1 1 1 1 1 1 1 1 1 1 1
symmnumber: 1
zpe: 963319.8 jmol-1
zpe.correction: 0.366909 hartree
zpe.thermalcorrener: 0.386550 hartree
zpe.thermalcorrenthalpy: 0.387495 hartree
zpe.thermalcorrgfe: 0.315778 hartree
zpe.sumelectzpe: -660.195512 hartree
zpe.sumelectthermal: -660.175871 hartree
zpe.sumelectthermalent: -660.174927 hartree
zpe.sumelectthermalfe: -660.246643 hartree
dipole: 0.3312 -0.1084 -1.4580
dipole: 1.4991
quadrupole: -98.2912 -89.2136 -101.4712
quadrupole: -0.4252 5.3100 1.4879
quadrupole: -1.9659 7.1118 -5.1459 -0.4252 5.3100 1.4879
hfenergy: -660.5624212 hartree
pointgroup: C01 [X(C13H26O2)]
dipole: 0.1302719 0.1054216 0.5654868 debye
polarizability: 179.6822074|-0.9452862|132.7449604|1.3219487|-1.3709667|131.2297949 unknown
InChI: InChI=1S/C13H26O2/c1-3-5-6-7-8-9-10-11-12(4-2)13(14)15/h12,14H,3-11H2,1-2H3
charge 0 multiplicity 1
41 atoms
O  -4.223761 -2.10393 0.587761
O  -3.855521 -1.155617 -1.494934
C  -1.109501 0.244847 0.167534
C  0.267655 0.133395 0.860133
C  -2.275736 0.223417 1.181155
C  1.45234 0.174812 -0.131193
C  -3.709943 0.258755 0.551946
C  2.830424 0.047286 0.556116
C  4.015216 0.0930 -0.435183
C  -3.969805 1.519765 -0.305773
C  5.393901 -0.043861 0.24922
C  6.577873 0.004645 -0.743606
C  -3.933955 -1.013069 -0.254047
C  -5.45643 1.708861 -0.675252
C  7.951721 -0.137272 -0.053359
H  -1.141527 1.179753 -0.426413
H  -1.222864 -0.586234 -0.557535
H  0.377698 0.95675 1.597301
H  0.309967 -0.811266 1.44218
H  -2.191866 1.099409 1.855643
H  -2.194035 -0.679385 1.817793
H  1.415671 1.123848 -0.706158
H  1.336515 -0.641618 -0.874404
H  -4.429404 0.231763 1.394402
H  2.94523 0.861611 1.302203
H  2.868124 -0.903924 1.12766
H  3.981041 1.046754 -1.002735
H  3.89683 -0.717498 -1.184824
H  -3.369354 1.462387 -1.232085
H  -3.609975 2.399824 0.263338
H  5.513758 0.764965 1.000517
H  5.430654 -0.999076 0.814213
H  6.455204 -0.801888 -1.495411
H  6.542104 0.960203 -1.306028
H  -6.090471 1.781423 0.228932
H  -5.602862 2.632127 -1.264638
H  -5.821557 0.863071 -1.285571
H  8.111987 0.674644 0.681176
H  8.024896 -1.098567 0.489788
H  8.779815 -0.099064 -0.785078
H  -4.327458 -2.923047 0.030517
