program: Gaussian 09
title: 000170752
version: EM64L-G09RevD.01
frameworkgroup: C1[X(C9H16O4)]
method: RPBEPBE
basis: SDD
operation: Freq
keyword: #pfreq=noraman
keyword: PBEPBE/SDD
title: #p freq=noraman PBEPBE/SDD
converged: YES YES NO NO
title: Mulliken charges:
elementType: O O O O C C C C C C C C C H H H H H H H H H H H H H H H H
charge: -0.266046 -0.269527 -0.273789 -0.254164 -0.248956 -0.240155 -0.267783 -0.258798 0.170650 0.341324 -0.497588 -0.755812 -0.632950 0.192495 0.196094 0.183972 0.206008 0.219823 0.250857 0.180899 0.209014 0.196105 0.206439 0.233816 0.236271 0.246271 0.212990 0.227795 0.254745
chargesum: 0.00000
title: Mulliken charges with hydrogens summed into heavy atoms:
elementType: O O O O C C C C C C C C C
charge: -0.266046 -0.269527 -0.273789 -0.254164 0.139633 0.149825 0.202898 0.131115 0.170650 0.341324 0.138771 -0.060279 -0.150411
polarizability: 1.46293265e+02 6.45458537e+00 1.02411466e+02 1.19505083e+01 -5.21336794e+00 9.41763962e+01
1716.lowfreq: -8.6997 -2.4123 -0.0007 -0.0007 -0.0006 8.3919 15.9595 17.8867 36.0396
frequency: 15.9448 17.6189 36.0314 52.1129 67.7430 79.9641 123.1646 137.6914 157.8425 166.3954 203.0248 229.1076 263.5991 272.8602 292.3059 340.1575 368.2216 394.0757 456.3586 487.0546 527.5975 581.5824 633.8996 781.1370 786.7526 795.6424 806.8217 864.8969 927.2123 949.9657 988.2694 995.6194 1008.9825 1017.3134 1042.2115 1053.5756 1065.6637 1067.2354 1107.8193 1114.3236 1121.7240 1122.4299 1158.1447 1198.2069 1201.4686 1251.3780 1253.2853 1288.2320 1339.4277 1360.9086 1374.9912 1396.2380 1413.2978 1415.0684 1436.3595 1451.3579 1453.1161 1454.8094 1457.3820 1459.5949 1471.1648 1473.0995 1478.9037 1607.1808 1654.7565 2915.8209 2921.9370 2925.2885 2936.7992 2973.8000 2980.7319 2989.3793 2990.7382 2994.7969 3019.4352 3073.3667 3087.6093 3097.3115 3102.4909 3103.5969 3215.7100
redmass: 4.3786 3.7108 3.3649 3.4112 4.3949 3.2261 3.9027 3.5734 2.5259 1.1119 2.6621 1.2930 3.2535 2.4244 2.8116 2.8392 2.7867 3.5596 3.1378 3.5750 2.8425 3.5495 1.5501 2.2831 2.2920 3.6441 3.2029 3.9999 2.1680 1.9493 1.3186 2.5251 1.4504 2.4432 2.4779 1.5036 2.3954 3.7394 1.7495 2.6063 2.7117 2.6185 1.4219 1.1137 1.1161 1.1078 1.1274 3.2824 1.2405 1.3895 1.4292 1.1663 1.5501 1.2513 1.1578 1.0794 1.0886 1.0456 1.0619 1.0662 1.0763 1.0675 1.0660 11.3791 5.1942 1.0494 1.0468 1.0527 1.0566 1.1029 1.1038 1.0360 1.1026 1.1024 1.0597 1.0969 1.1060 1.1009 1.0968 1.0618 1.1156
irintensity: 0.3081 0.2100 0.7094 1.4369 2.7262 12.6261 7.0675 1.5520 3.4851 0.9372 4.2055 3.4207 8.9076 3.7490 2.4198 0.0868 2.6602 0.1940 14.2099 5.6692 2.3196 1.9512 9.8417 3.9081 14.2833 0.8624 16.8865 7.0997 37.8251 13.7158 59.2913 27.2093 9.1990 16.9223 21.4813 7.0186 22.9444 185.5113 21.4712 46.3636 215.6120 167.8999 7.8256 1.0717 15.4918 3.8933 10.0272 112.6877 25.5102 4.2009 7.0871 21.6572 3.7034 10.7385 0.4308 10.8969 19.4799 11.9638 20.1714 14.7959 23.9348 21.0657 5.1526 151.6956 3.0255 29.3476 16.1121 133.5952 90.8008 64.1423 60.6691 17.2938 89.8377 46.6859 27.7145 15.7073 19.5056 27.1479 31.2670 5.1742 5.8007
temp: 298.150 k
press: 1.00000 atm
elementType: 8 8 8 8 6 6 6 6 6 6 6 6 6 1 1 1 1 1 1 1 1 1 1 1 1 1 1 1 1
symmnumber: 1
zpe: 627436.2 jmol-1
zpe.correction: 0.238978 hartree
zpe.thermalcorrener: 0.254989 hartree
zpe.thermalcorrenthalpy: 0.255933 hartree
zpe.thermalcorrgfe: 0.191829 hartree
zpe.sumelectzpe: -652.338379 hartree
zpe.sumelectthermal: -652.322368 hartree
zpe.sumelectthermalent: -652.321424 hartree
zpe.sumelectthermalfe: -652.385527 hartree
dipole: -1.6705 2.2647 -2.4440
dipole: 3.7272
quadrupole: -72.9220 -74.5198 -76.2648
quadrupole: 1.5193 -3.4323 4.3250
quadrupole: 1.6468 0.0491 -1.6959 1.5193 -3.4323 4.3250
hfenergy: -652.5773567 hartree
pointgroup: C01 [X(C9H16O4)]
dipole: 0.7077471 -0.4030176 -1.2194342 debye
polarizability: 146.7549844|10.8477392|97.1096848|-6.3237928|6.9075871|99.0164576 unknown
InChI: InChI=1S/C9H16O4/c1-8(2)9(10)13-7-6-12-5-4-11-3/h1,4-7H2,2-3H3
charge 0 multiplicity 1
29 atoms
O  1.581147 0.427981 -0.160869
O  -1.405605 0.435266 -0.221901
O  4.470858 -0.19344 0.602419
O  -2.992383 0.737167 1.457584
C  0.722405 1.595713 -0.352564
C  2.786527 0.478686 -0.994867
C  -0.529086 1.407483 0.48523
C  3.709609 -0.65112 -0.562381
C  -2.635896 0.173189 0.392337
C  -3.423062 -0.84005 -0.387926
C  5.262493 -1.264067 1.200538
C  -2.819148 -1.420814 -1.649536
C  -4.648488 -1.181903 0.097393
H  1.250422 2.516242 -0.015087
H  0.448992 1.721724 -1.423646
H  2.506315 0.361758 -2.065656
H  3.317297 1.447491 -0.86953
H  -1.081349 2.356909 0.609545
H  -0.279002 1.009408 1.484092
H  4.405769 -0.915804 -1.390602
H  3.098618 -1.545876 -0.313051
H  6.005555 -1.678267 0.483947
H  4.618059 -2.093079 1.563721
H  5.793419 -0.815113 2.054704
H  -2.620964 -0.628844 -2.394259
H  -1.846167 -1.898513 -1.437161
H  -3.495139 -2.168339 -2.098354
H  -5.280118 -1.916417 -0.413714
H  -5.028375 -0.724972 1.017694
