program: Gaussian 09
title: 000170779
version: EM64L-G09RevD.01
frameworkgroup: C1[X(C22H25N2O2)]
method: RPBEPBE
basis: SDD
operation: Freq
keyword: #p
keyword: freq=noraman
keyword: PBEPBE/SDD
title: #p freq=noraman PBEPBE/SDD
converged: YES YES NO NO
title: Mulliken charges:
elementType: O O N N C C C C C C C C C C C C C C C C C C C C C C H H H H H H H H H H H H H H H H H H H H H H H H H
charge: -0.264493 -0.216378 -0.108885 -0.232851 0.258632 -0.207317 -0.265247 -0.146021 -0.270048 -0.537165 -0.547149 -0.399395 -0.637777 0.239621 0.561036 -0.117830 0.215191 -0.608311 -0.570223 0.121671 -0.430109 -0.419057 -0.341190 -0.332721 -0.249476 -0.209111 0.301101 0.289120 0.275588 0.272497 0.236382 0.277668 0.294865 0.256556 0.282658 0.288038 0.288379 0.273128 0.258256 0.274573 0.271700 0.269212 0.279294 0.274846 0.255806 0.224759 0.212220 0.248813 0.315283 0.244040 0.249823
chargesum: 1.00000
title: Mulliken charges with hydrogens summed into heavy atoms:
elementType: O O N N C C C C C C C C C C C C C C C C C C C C C C
charge: -0.264493 -0.216378 -0.108885 -0.232851 0.258632 0.093783 0.023872 0.129567 0.002449 -0.023114 0.004273 0.171301 -0.076270 0.239621 0.561036 0.140426 0.215191 0.207174 -0.016083 0.121671 -0.174303 -0.194299 0.119844 -0.017438 -0.005436 0.040711
polarizability: 2.85058614e+02 8.57747818e+00 2.65240094e+02 -1.27412999e+01 -7.37908979e+00 1.58519436e+02
1716.lowfreq: -12.4317 -3.6561 -0.0005 -0.0004 -0.0002 6.1255 53.6626 73.9108 94.3683
frequency: 53.6171 73.9010 94.3639 103.6247 121.2232 152.5145 206.4962 215.2630 231.8692 236.7430 263.6114 269.6952 271.1502 297.7905 311.9410 313.6032 336.4270 357.0683 377.4673 395.8423 411.7096 419.8389 423.1752 450.9177 452.5064 484.1177 496.9625 515.0892 526.0013 544.3209 558.4485 568.7149 606.3458 614.6098 632.7498 648.1938 654.4774 676.7133 690.8805 724.8697 750.8543 760.8718 766.3433 769.3408 782.5629 812.7593 848.1826 862.4761 870.0555 882.2399 889.4255 897.7880 915.7352 931.3812 942.9057 951.9426 957.9202 976.2910 980.2420 991.2931 1001.0610 1003.3972 1012.8819 1020.1648 1028.2255 1031.0957 1038.7789 1065.9870 1078.0993 1090.0515 1091.9443 1097.0859 1110.3199 1119.8128 1130.5341 1140.1293 1157.9689 1170.0513 1177.4304 1187.0380 1196.9487 1203.9041 1215.6599 1219.6115 1234.0486 1236.4965 1238.7469 1248.8792 1265.3501 1271.9160 1290.9200 1291.5508 1296.9719 1298.3475 1309.5260 1316.2525 1324.1335 1330.0148 1332.5031 1342.7737 1350.8832 1353.6513 1359.6554 1362.0425 1371.1824 1385.2195 1397.9348 1435.0542 1441.4872 1452.7975 1453.6641 1456.6574 1468.9424 1470.5769 1473.6949 1475.8537 1478.4548 1485.6880 1594.1484 1604.5922 1618.6042 1677.8900 2953.7875 2960.6380 2970.5341 2979.5668 3003.3943 3004.5940 3008.7322 3015.8092 3016.6943 3019.4825 3039.1411 3044.4804 3065.9601 3086.7859 3091.0566 3093.4970 3102.2944 3111.4531 3112.5957 3115.3240 3130.3937 3136.1507 3151.3348 3171.9324 3201.8792
redmass: 4.7110 4.0913 3.6580 4.3913 4.3318 4.1126 4.3380 2.9260 3.7566 4.3003 3.2382 2.5672 1.2686 3.0193 3.3129 3.4803 3.3546 3.6466 3.5000 3.2173 3.5453 3.7987 2.2779 3.4429 4.0799 4.1879 3.4227 3.4050 3.7550 4.0553 3.9044 3.5127 4.2022 3.7755 4.6808 3.9865 3.9736 4.4234 4.2736 4.1094 4.7000 3.3505 2.3630 1.4978 3.2106 3.0705 1.8831 3.1554 2.2895 1.4436 2.6167 3.1592 4.0228 2.5960 2.3989 1.3881 2.6740 2.1085 3.1609 3.5264 1.3282 3.2792 2.2725 2.5701 2.0795 2.2187 2.3488 2.3308 2.7452 2.6160 1.8954 2.3291 2.6979 1.7856 2.6619 1.6175 1.7562 1.8161 1.1132 1.4038 1.6354 1.6629 1.4061 1.3419 1.4605 1.3617 2.0195 1.5349 1.5563 1.6199 1.6065 1.4472 1.3701 1.3299 1.6873 1.5620 1.3594 1.4241 1.4301 1.3278 1.4423 1.4210 1.4390 1.3493 1.9573 1.5239 5.8912 1.1591 1.0796 2.5158 1.0866 1.0874 1.0736 1.5018 1.2796 1.0697 1.3273 1.0725 7.8127 7.2946 9.2921 7.9485 1.0687 1.0833 1.0846 1.0844 1.0852 1.0663 1.0621 1.0439 1.0514 1.0644 1.0605 1.0862 1.1009 1.1044 1.0936 1.1017 1.0953 1.0899 1.0941 1.1083 1.1049 1.1047 1.0892 1.0973 1.0959
irintensity: 0.4468 1.8339 4.0158 0.5936 2.1866 2.4896 1.3344 2.0169 4.9645 3.7976 1.8958 0.9116 0.3694 4.3745 2.2649 1.3131 0.6056 2.0205 3.7416 0.9862 0.9744 5.5655 1.0592 3.1574 5.9785 4.9890 1.9441 2.4904 9.9782 0.5149 1.8858 0.9125 3.1725 3.7624 11.5863 3.1906 0.6657 4.4821 2.5368 0.3581 0.1120 11.8577 10.3380 72.8195 2.0079 12.2650 35.8352 1.3941 6.4104 2.8431 10.1400 11.4834 7.4985 15.8698 10.9085 3.6032 9.9255 11.0187 19.3581 14.6273 1.3751 13.5458 8.1970 26.8797 2.4393 4.6636 18.4519 1.7306 13.9751 13.1898 3.6539 7.6568 1.6865 6.1112 9.6023 1.8159 5.8441 15.5272 0.8478 12.5961 8.1973 1.7916 17.4515 22.2865 18.7784 11.7882 9.5719 1.7819 9.5789 7.9708 15.4043 3.2995 7.8081 2.8338 101.4251 3.6479 1.5968 14.4613 28.2506 6.6513 1.4457 2.8736 37.2033 5.7533 56.5507 1.1592 38.1247 15.6217 17.4053 43.4419 23.6029 15.2924 5.1231 69.9370 22.7742 10.1043 77.4785 44.4223 87.6374 47.3685 163.9002 3.1861 45.9618 15.0188 10.6336 22.8957 16.2267 0.8077 3.0795 4.0778 23.2104 7.1682 6.3450 14.3457 12.6479 4.7615 9.5152 2.0756 3.6763 12.1921 17.3910 5.1219 4.7578 3.9828 4.9977 12.3457 3.3323
temp: 298.150 k
press: 1.00000 atm
elementType: 8 8 7 7 6 6 6 6 6 6 6 6 6 6 6 6 6 6 6 6 6 6 6 6 6 6 1 1 1 1 1 1 1 1 1 1 1 1 1 1 1 1 1 1 1 1 1 1 1 1 1
symmnumber: 1
zpe: 1132255.1 jmol-1
zpe.correction: 0.431253 hartree
zpe.thermalcorrener: 0.450653 hartree
zpe.thermalcorrenthalpy: 0.451598 hartree
zpe.thermalcorrgfe: 0.386278 hartree
zpe.sumelectzpe: -1111.160363 hartree
zpe.sumelectthermal: -1111.140963 hartree
zpe.sumelectthermalent: -1111.140018 hartree
zpe.sumelectthermalfe: -1111.205338 hartree
dipole: 9.2978 -9.6246 0.8856
dipole: 13.4114
quadrupole: -117.3466 -118.6261 -140.3980
quadrupole: 0.7230 -2.1421 6.0581
quadrupole: 8.1103 6.8308 -14.9411 0.7230 -2.1421 6.0581
hfenergy: -1111.5916159 hartree
pointgroup: C01 [X(C22H25N2O2)]
dipole: -3.5042348 -3.938026 -0.2308029 debye
polarizability: 285.188608|-7.7943116|264.7270067|-15.361233|5.6338551|158.9025297 unknown
InChI: InChI=1S/C22H25N2O2/c1-24-8-7-22-15-4-2-3-5-16(15)23-19(25)11-17-20(21(22)23)14(10-18(22)24)13(12-24)6-9-26-17/h2-6,14,17-18,20-21H,7-12H2,1H3
charge 1 multiplicity 1
51 atoms
O  -2.194393 2.623976 0.562133
O  2.533199 3.243055 0.131698
N  -1.723701 -2.33918 0.30733
N  1.387847 1.224924 0.411159
C  0.402221 -0.999527 0.352052
C  -0.50881 -1.841142 -0.594571
C  0.061072 0.537404 0.384712
C  -0.696698 1.129975 -0.829304
C  -1.782397 0.171617 -1.387481
C  -1.035915 -1.112002 -1.836511
C  0.14234 -1.673356 1.737248
C  -1.370144 -1.910508 1.758131
C  -3.062437 -1.690177 -0.145023
C  1.886121 -1.009032 -0.014544
C  -2.888642 -0.210884 -0.394226
C  -1.105388 2.576245 -0.438247
C  2.426932 0.297526 0.108288
C  -1.850275 -3.851637 0.212311
C  0.078453 3.324655 0.249009
C  1.442789 2.619622 0.251903
C  -3.692994 0.694898 0.225122
C  2.720592 -2.09587 -0.33068
C  -3.518984 2.193759 0.06969
C  3.803112 0.548767 -0.078687
C  4.102701 -1.861089 -0.535017
C  4.629005 -0.55234 -0.406914
H  0.029869 -2.762639 -0.876153
H  -0.509034 0.788771 1.2997
H  0.042059 1.246998 -1.650493
H  -2.247798 0.656481 -2.269948
H  -1.675222 -1.777429 -2.445403
H  -0.169379 -0.853239 -2.471345
H  0.468504 -1.03327 2.573066
H  0.705545 -2.62164 1.807266
H  -1.711501 -2.694425 2.452176
H  -1.921095 -0.97738 1.960013
H  -3.801522 -1.896798 0.647499
H  -3.367126 -2.235954 -1.056324
H  -1.437717 3.117782 -1.34917
H  -1.945205 -4.142051 -0.845982
H  -0.952427 -4.319621 0.644505
H  -2.7437 -4.179029 0.767369
H  -0.227982 3.49656 1.299616
H  0.241992 4.318258 -0.195747
H  -4.477043 0.346614 0.911471
H  2.326315 -3.116598 -0.417002
H  -3.655824 2.512497 -0.986701
H  -4.245808 2.738802 0.691517
H  4.199321 1.560606 0.020874
H  4.767406 -2.693514 -0.78566
H  5.699968 -0.385061 -0.561524
