program: Gaussian 09
title: 000170777
version: EM64L-G09RevD.01
frameworkgroup: C1[X(C13H25N7O3)]
method: RPBEPBE
basis: SDD
operation: Freq
keyword: #p
keyword: freq=noraman
keyword: PBEPBE/SDD
title: #p freq=noraman PBEPBE/SDD
converged: YES YES NO NO
title: Mulliken charges:
elementType: O O O N N N N N N N C C C C C C C C C C C C C H H H H H H H H H H H H H H H H H H H H H H H H H
charge: -0.290282 -0.363936 -0.324311 -0.328867 -0.390204 -0.334136 -0.266419 -0.584884 -0.654622 -0.680039 -0.241598 -0.444545 -0.434647 -0.397397 0.186471 -0.113957 -0.446413 -0.401669 0.131625 -0.451292 -0.535199 0.260508 0.320793 0.235898 0.222454 0.225266 0.219437 0.222294 0.192209 0.220609 0.294094 0.262587 0.338846 0.282680 0.216744 0.214958 0.217413 0.224440 0.203388 0.430399 0.263980 0.245812 0.378699 0.322107 0.340059 0.313781 0.296020 0.400842
chargesum: 0.00000
title: Mulliken charges with hydrogens summed into heavy atoms:
elementType: O O O N N N N N N N C C C C C C C C C C C C C
charge: -0.290282 -0.363936 -0.324311 -0.034773 -0.051358 0.096264 -0.266419 0.115922 -0.000783 0.016823 -0.005700 0.003175 0.007084 0.015421 0.186471 0.148631 0.053011 0.030703 0.131625 -0.023464 -0.025406 0.260508 0.320793
polarizability: 2.74780557e+02 -5.42383642e+00 1.96639365e+02 -2.18528459e+00 -4.29203075e+00 1.40504160e+02
1716.lowfreq: -5.7050 -0.0008 -0.0006 -0.0006 1.3718 6.9955 21.4798 36.0303 38.3256
frequency: 21.3122 35.6134 38.2213 42.5287 58.8426 70.2757 80.0882 103.7983 107.2331 126.1943 131.0169 140.1431 153.6917 172.6052 192.1745 225.2385 228.9990 237.5378 244.6823 265.0129 284.0997 290.5596 311.0635 334.6715 349.1737 375.7165 428.2853 440.6012 443.5068 468.0255 476.9861 510.5242 523.5102 544.5203 551.6154 558.1179 578.0046 590.3154 619.3505 640.1759 662.5765 672.9232 721.4201 726.3887 755.0458 766.7643 789.9831 807.0059 821.0908 846.1746 850.8131 866.4720 869.6550 879.4281 898.3892 923.5977 925.7373 953.3436 976.7620 980.4391 996.0270 1004.9629 1037.4262 1048.7471 1057.7599 1062.1848 1065.9874 1096.7883 1104.3289 1120.7420 1128.3966 1139.0223 1143.8797 1161.7248 1164.9456 1172.8488 1182.6593 1215.6403 1223.4652 1235.3506 1238.9185 1269.1763 1271.8138 1278.9505 1295.3776 1300.0598 1304.5383 1313.0130 1325.6656 1331.2791 1335.4304 1342.7537 1361.0507 1369.9707 1377.4475 1435.3515 1444.4258 1451.7887 1463.4553 1466.7623 1469.4480 1470.1184 1478.3932 1483.6415 1500.5940 1541.2297 1595.3655 1605.3700 1610.3327 1622.1917 1639.2976 1658.7118 1677.4070 2186.6191 2894.1030 2917.0170 2928.7535 2932.6588 2953.8284 2997.4319 2999.9765 3003.7835 3005.0287 3023.9464 3025.1614 3049.5990 3068.5577 3076.8364 3083.4983 3104.4841 3217.8048 3310.9267 3430.0712 3460.9601 3554.3494 3601.1826 3626.1282 3697.8510
redmass: 5.0615 3.5706 5.2341 3.0650 4.3159 5.2760 4.7834 6.1914 5.0854 5.1588 5.2053 6.7035 5.9618 3.4600 4.0295 4.0827 3.3221 2.2193 4.7903 3.1131 4.8990 2.2648 5.5056 3.2790 4.3466 1.1843 2.1024 1.6540 1.4481 1.2602 2.9181 2.6553 3.5343 3.2145 2.0342 3.3648 2.9288 3.2881 2.2733 1.5603 1.4073 5.6478 3.8513 2.7930 3.6272 2.8233 2.8557 1.1369 2.3251 1.2763 2.1124 3.4432 2.2345 2.0724 1.9351 2.5341 2.5657 2.7293 1.8087 2.1828 2.1666 2.7603 3.0517 1.5068 2.0392 1.8841 2.2452 2.5256 2.3416 1.7652 2.0390 1.8043 1.3938 1.7874 1.5066 1.8185 1.4823 1.2840 1.3691 1.2953 1.2186 1.3457 1.2234 1.3643 1.3507 1.4065 1.5232 1.3868 1.3405 1.2910 1.3729 1.3602 2.2932 1.6152 3.2669 1.2963 1.8346 1.7495 1.0921 1.0906 1.1005 1.0944 1.1175 1.9971 1.0892 3.8825 2.4829 5.4923 1.7592 1.2739 3.3119 1.3075 1.2726 1.1487 1.0609 1.0701 1.0805 1.0840 1.0957 1.0655 1.0607 1.0634 1.0684 1.0870 1.0604 1.1017 1.1013 1.0979 1.1056 1.1038 1.0719 1.0618 1.0741 1.0766 1.0454 1.0914 1.0851 1.1038
irintensity: 0.7174 1.1290 3.9028 0.2673 0.5086 2.3554 4.6451 10.3601 3.2444 6.8456 3.9403 1.9190 5.4814 9.2845 21.7639 13.3398 8.5778 2.9688 3.3870 8.8661 25.3231 4.1131 28.6067 15.4590 16.7385 27.2384 6.7171 150.0382 249.8393 3.5890 4.6288 3.7499 18.3107 36.8360 24.4624 5.5992 76.4323 18.7247 49.4584 83.6644 62.6680 1.3815 52.5292 16.8660 73.9551 28.4797 41.3540 189.6836 8.4107 113.8300 58.0476 2.9337 14.7467 8.3820 5.9577 4.3946 9.2790 5.6120 67.8163 22.9712 16.9423 41.2659 23.5620 1.4287 24.2701 10.1652 7.0654 4.0663 10.4448 21.0569 20.4793 5.1441 69.2547 6.7516 20.1686 4.0663 18.8335 2.6784 3.0289 39.6385 65.9194 35.9116 5.5386 48.6993 23.4130 36.9532 41.5302 2.7158 1.8150 14.0712 32.7310 39.2684 18.9550 15.8939 87.8727 103.0276 152.3217 25.1192 7.7111 9.6231 8.7705 2.1026 54.7820 534.6972 3.0889 182.1420 21.3202 115.5000 161.7279 112.0992 610.0404 627.0430 36.7424 1936.7741 69.6095 124.0664 24.2984 41.4619 33.1699 6.2227 21.0186 62.8036 19.1372 97.9919 19.5162 21.3874 21.4762 15.1362 56.4866 6.5792 801.2906 231.1176 23.0517 85.8473 29.4534 56.8507 56.0046 22.8980
temp: 298.150 k
press: 1.00000 atm
elementType: 8 8 8 7 7 7 7 7 7 7 6 6 6 6 6 6 6 6 6 6 6 6 6 1 1 1 1 1 1 1 1 1 1 1 1 1 1 1 1 1 1 1 1 1 1 1 1 1
symmnumber: 1
zpe: 1055888.8 jmol-1
zpe.correction: 0.402167 hartree
zpe.thermalcorrener: 0.426110 hartree
zpe.thermalcorrenthalpy: 0.427054 hartree
zpe.thermalcorrgfe: 0.347530 hartree
zpe.sumelectzpe: -1117.575496 hartree
zpe.sumelectthermal: -1117.551553 hartree
zpe.sumelectthermalent: -1117.550609 hartree
zpe.sumelectthermalfe: -1117.630133 hartree
dipole: 5.0325 -1.1594 -0.7459
dipole: 5.2179
quadrupole: -120.8846 -129.7595 -139.8492
quadrupole: -29.1208 -1.2429 0.8679
quadrupole: 9.2798 0.4049 -9.6847 -29.1208 -1.2429 0.8679
hfenergy: -1117.9776632 hartree
pointgroup: C01 [X(C13H25N7O3)]
dipole: 1.9860733 -0.4663854 -0.2287652 debye
polarizability: 274.8337008|-5.1661311|195.9380918|0.7261561|-7.5611883|141.1522886 unknown
InChI: InChI=1S/C13H25N7O3/c14-10(21)7-19-11(22)9(4-2-6-18-13(15)16)20-12(23)8-3-1-5-17-8/h8-9,17,19-20H,1-7,14-16H2
charge 0 multiplicity 1
48 atoms
O  -2.9301 -1.645172 0.922184
O  0.000625 2.259587 0.443137
O  4.283111 2.134908 -0.977281
N  -4.983239 -1.152591 -0.891774
N  -1.636443 0.131899 0.135813
N  1.818004 0.873664 0.948483
N  3.063764 -1.338462 0.090384
N  2.18318 3.144863 -1.156029
N  4.992953 -2.718358 -0.27711
N  5.227686 -0.395009 -0.034476
C  -3.915465 -0.129683 -0.759053
C  -4.628228 1.152959 -0.211425
C  -6.088421 0.955808 -0.688228
C  -6.297841 -0.565281 -0.501305
C  -2.787036 -0.619119 0.178386
C  -0.481428 -0.06953 1.031806
C  0.141839 -1.483642 0.962855
C  0.714962 -1.905752 -0.417787
C  0.489746 1.103064 0.762607
C  2.158193 -2.444776 -0.30678
C  2.742955 2.023032 0.946669
C  3.146225 2.446614 -0.48099
C  4.375007 -1.482297 -0.064483
H  -3.46453 0.09503 -1.74946
H  -4.591489 1.16214 0.894554
H  -4.169001 2.086954 -0.579204
H  -6.182794 1.223142 -1.75697
H  -6.812997 1.557985 -0.113446
H  -6.56428 -0.780396 0.55897
H  -7.11244 -0.950248 -1.141989
H  -4.73573 -2.002163 -0.363401
H  -0.823081 0.069684 2.083234
H  -1.642155 1.041971 -0.342065
H  -0.641326 -2.189825 1.284393
H  0.941688 -1.517027 1.727759
H  0.716675 -1.052267 -1.122859
H  0.07275 -2.684005 -0.86971
H  2.470891 -2.882071 -1.280973
H  2.167591 -3.271709 0.442011
H  2.30607 -0.097372 0.708424
H  2.26504 2.872396 1.465746
H  3.659721 1.731141 1.482774
H  1.246359 3.213002 -0.722156
H  2.348033 3.417321 -2.125642
H  4.479561 -3.580286 -0.116465
H  5.913195 -2.776579 -0.705972
H  6.214507 -0.531268 0.172295
H  4.902093 0.550624 -0.314852
