program: Gaussian 09
title: 000170728
version: EM64L-G09RevD.01
frameworkgroup: C1[X(C14H16N2)]
method: RPBEPBE
basis: SDD
operation: Freq
keyword: #pfreq=noraman
keyword: PBEPBE/SDD
title: #p freq=noraman PBEPBE/SDD
converged: YES YES NO NO
title: Mulliken charges:
elementType: N N C C C C C C C C C C C C C C H H H H H H H H H H H H H H H H
charge: -0.463205 -0.463136 0.278970 -0.429669 -0.032523 0.353223 0.353228 -0.687103 0.485695 -0.672907 -0.464402 -0.464388 -0.496418 -0.496412 -0.207961 -0.207965 0.199903 0.199791 0.276931 0.276890 0.208166 0.250872 0.208186 0.226835 0.227191 0.208494 0.216490 0.216483 0.233258 0.233257 0.216112 0.216115
chargesum: 0.00000
title: Mulliken charges with hydrogens summed into heavy atoms:
elementType: N N C C C C C C C C C C C C C C
charge: -0.186274 -0.186245 0.278970 -0.029974 -0.032523 0.353223 0.353228 -0.019879 0.485695 -0.010388 -0.247912 -0.247905 -0.263160 -0.263155 0.008150 0.008149
polarizability: 2.18888725e+02 8.22204934e-04 1.95769230e+02 5.13376485e+00 1.74799093e-03 9.44835234e+01
1716.lowfreq: -12.0183 -8.4554 -0.0009 0.0004 0.0005 5.4510 65.5840 69.5863 115.7409
frequency: 65.5257 69.5133 115.7399 161.6314 163.0428 196.3123 236.9485 246.0950 246.1904 250.4959 336.1438 375.2480 402.7753 409.7907 422.1226 449.6515 461.6731 469.0255 487.6048 507.5311 543.5164 575.4788 585.6826 635.8198 639.1167 680.8115 750.0569 755.8932 776.1515 781.8333 818.7436 830.1268 840.6683 843.4775 876.7271 900.8223 956.0420 965.7189 967.0864 980.9217 1032.9357 1037.5239 1037.6148 1074.0079 1086.8690 1118.9184 1129.6283 1178.5750 1185.5943 1197.6128 1203.6071 1224.0069 1274.5222 1291.0985 1295.8167 1333.4115 1365.4330 1374.4965 1391.2861 1405.6155 1417.5447 1437.4605 1442.1913 1457.3720 1457.5628 1462.1439 1462.5173 1472.7210 1488.4428 1498.6323 1529.6682 1590.8808 1614.1039 1630.1679 2970.7335 2975.6094 2991.5837 3022.4928 3070.0986 3085.4076 3088.6195 3093.8868 3114.8694 3114.9958 3129.9339 3131.1539 3151.6874 3154.0620 3549.9701 3550.4614
redmass: 3.7300 2.7606 1.7900 3.8827 1.5316 3.1986 3.0803 3.9716 1.0190 2.1397 1.6905 2.4722 2.2841 2.2488 1.7975 3.8434 3.2531 3.3232 4.3672 3.8404 4.2723 5.1968 5.7698 3.9386 2.8811 4.5182 1.3069 1.6241 1.3440 5.1585 2.9080 3.2048 3.3019 1.4299 1.6166 2.2372 1.3128 1.3502 1.7596 1.4971 1.4229 3.9277 3.3360 2.2922 2.0226 3.0633 1.8497 1.2246 1.4503 2.1332 1.7832 1.6256 1.4718 1.6580 2.1407 1.5384 3.2489 1.2135 1.2144 1.7919 5.3560 5.4732 1.9549 1.7266 1.1482 1.1142 1.1996 1.3151 1.0583 1.5302 4.5175 5.1971 7.6729 6.5935 1.0489 1.0458 1.0369 1.1005 1.0999 1.0999 1.1001 1.0997 1.0862 1.0861 1.0906 1.0902 1.0995 1.0987 1.0759 1.0773
irintensity: 0.4060 0.0378 0.0002 6.2274 0.0208 7.0654 0.0615 21.5489 0.0091 0.1175 0.0010 6.1347 0.4434 95.7375 98.0237 5.0136 5.0446 3.9055 0.1252 0.0121 12.2283 13.3910 2.0744 11.8221 0.5557 0.5970 0.0737 102.0390 2.4025 3.5205 83.6086 2.5301 0.2941 0.1042 10.7364 0.3110 0.0061 4.2601 0.2477 23.9602 8.4782 20.3173 14.5867 22.1981 27.0846 36.8135 2.5975 6.2076 24.8430 16.2661 16.4898 0.2797 4.5341 3.6908 6.4928 8.1729 18.7008 18.2129 19.2547 30.7820 134.8113 53.7614 8.6332 10.5526 23.3501 1.5779 19.7253 3.1726 19.3273 42.8537 0.0059 16.9844 437.3249 49.1334 1.7669 66.0959 31.2659 14.6293 26.7526 33.9287 41.8378 33.0470 0.4554 22.3449 20.8198 15.2642 48.4641 27.8569 10.4957 18.2300
temp: 298.150 k
press: 1.00000 atm
elementType: 7 7 6 6 6 6 6 6 6 6 6 6 6 6 6 6 1 1 1 1 1 1 1 1 1 1 1 1 1 1 1 1
symmnumber: 1
zpe: 700852.0 jmol-1
zpe.correction: 0.266940 hartree
zpe.thermalcorrener: 0.280965 hartree
zpe.thermalcorrenthalpy: 0.281909 hartree
zpe.thermalcorrgfe: 0.227374 hartree
zpe.sumelectzpe: -651.466060 hartree
zpe.sumelectthermal: -651.452036 hartree
zpe.sumelectthermalent: -651.451092 hartree
zpe.sumelectthermalfe: -651.505627 hartree
dipole: 3.8647 0.0000 1.0287
dipole: 3.9992
quadrupole: -85.1055 -84.8282 -101.9986
quadrupole: 0.0011 2.1157 0.0002
quadrupole: 5.5386 5.8159 -11.3545 0.0011 2.1157 0.0002
hfenergy: -651.7330008 hartree
pointgroup: C01 [X(C14H16N2)]
dipole: 1.5576302 -0.0045243 0.2223124 debye
polarizability: 218.3577632|0.004513|195.76616|-9.5977877|0.565462|95.0175548 unknown
InChI: InChI=1S/C14H16N2/c1-3-14(2)15-11-8-4-6-10-7-5-9-12(16-14)13(10)11/h4-9,15-16H,3H2,1-2H3
charge 0 multiplicity 1
32 atoms
N  1.358091 1.190384 -0.212954
N  1.35286 -1.190506 -0.22618
C  2.130157 -0.00407 0.196976
C  3.5077 -0.002925 -0.521416
C  -0.752749 0.003063 0.045033
C  -0.03229 1.247889 -0.043539
C  -0.037751 -1.243849 -0.057122
C  2.331166 -0.012968 1.744872
C  -2.189789 0.005496 0.169172
C  3.43175 0.005436 -2.060676
C  -0.736723 2.466721 -0.003631
C  -0.747426 -2.459993 -0.030269
C  -2.875508 1.264862 0.220524
C  -2.880948 -1.251376 0.20706
C  -2.15548 2.461332 0.127948
C  -2.166129 -2.449895 0.101556
H  4.073474 -0.890106 -0.170963
H  4.076589 0.878553 -0.161719
H  1.873708 2.071289 -0.228649
H  1.864607 -2.073443 -0.251558
H  2.894234 0.880368 2.074015
H  1.350026 -0.012749 2.251016
H  2.888926 -0.913056 2.064496
H  2.891614 -0.880846 -2.436305
H  2.8879 0.893746 -2.426078
H  4.445403 0.009975 -2.501403
H  -0.194973 3.417921 -0.072584
H  -0.209784 -3.412717 -0.109567
H  -3.966456 1.274983 0.320488
H  -3.971923 -1.257855 0.307029
H  -2.685445 3.420399 0.160838
H  -2.70023 -3.406963 0.124189
