program: Gaussian 09
title: 000170717
version: EM64L-G09RevD.01
frameworkgroup: C1[X(C9H11NO3)]
method: RPBEPBE
basis: SDD
operation: Freq
keyword: #p
keyword: freq=noraman
keyword: PBEPBE/SDD
title: #p freq=noraman PBEPBE/SDD
converged: YES YES NO NO
title: Mulliken charges:
elementType: O O O N C C C C C C C C C H H H H H H H H H H H
charge: -0.293883 -0.417618 -0.235180 -0.475471 -0.523871 0.355240 -0.494773 0.148672 -0.405974 -0.343290 -0.249773 -0.214674 0.183681 0.239806 0.226610 0.263438 0.282476 0.235966 0.282687 0.225257 0.224999 0.373954 0.307145 0.304577
chargesum: 0.00000
title: Mulliken charges with hydrogens summed into heavy atoms:
elementType: O O O N C C C C C C C C C
charge: -0.293883 -0.043664 -0.235180 0.136251 -0.057455 0.355240 0.051141 0.148672 -0.170008 -0.060603 -0.024516 0.010325 0.183681
polarizability: 1.40412968e+02 -5.74773756e+00 1.23584561e+02 1.03271460e+01 2.44668417e+00 7.50536976e+01
1716.lowfreq: -10.1079 -5.0265 0.0006 0.0009 0.0010 7.8674 19.9602 42.5090 69.3146
frequency: 19.8841 42.4862 69.3131 86.5174 102.3875 159.0345 178.0548 196.9593 234.2422 291.6683 308.1735 411.8248 464.0182 482.2745 506.7959 522.9584 554.4420 577.2893 610.5260 640.1694 729.7203 743.4129 763.6059 779.8738 805.4283 831.6952 869.0365 891.7945 948.1256 982.0906 999.8762 1019.3408 1036.3013 1057.6673 1081.3610 1113.2382 1155.7164 1168.4301 1183.2017 1223.1926 1231.5333 1240.8756 1264.3584 1287.1683 1309.2961 1369.3725 1390.0728 1436.1757 1440.7692 1465.6690 1470.4440 1590.7790 1600.7228 1621.9278 1666.8755 3003.4438 3012.9393 3051.4818 3077.5156 3120.6991 3135.8403 3160.0214 3184.7212 3331.9820 3471.4911 3511.3450
redmass: 11.0062 5.0760 4.6566 2.9852 2.7511 1.8557 4.0902 1.9937 3.9467 5.1894 3.3972 4.3464 4.0438 3.6291 1.8076 5.2599 3.9525 5.8832 5.2538 1.3225 4.1526 3.9096 1.2669 1.5081 5.5665 4.0484 1.6414 2.6392 1.3869 1.2986 2.0121 3.6354 1.9011 2.2836 2.4848 1.6330 1.1634 1.0990 2.3440 2.3507 1.1448 1.4357 1.3280 1.2531 1.6953 1.7586 7.0772 2.0985 1.1412 1.4086 1.8026 6.1834 1.6470 2.2216 8.0831 1.0612 1.0597 1.0986 1.1025 1.0875 1.0895 1.0974 1.0944 1.0417 1.0992 1.0639
irintensity: 1.0058 0.1350 0.3699 2.9137 3.6228 19.6363 13.7961 29.5129 0.9594 0.7326 3.0098 7.0928 9.7965 17.5336 25.9214 46.4066 1.5641 1.7418 4.1930 124.4234 1.5604 12.4261 84.2254 22.8530 5.3364 35.6373 2.9508 2.3237 3.8295 1.1676 4.0815 174.9046 35.2856 51.2449 89.7340 39.2090 6.1098 2.8694 29.2588 26.8426 2.9706 3.4328 1.1178 12.0878 47.5591 46.1886 3.2592 33.0076 25.4920 33.7957 41.7874 17.4519 2.3012 30.0638 223.1855 11.4408 18.8713 1.5812 15.8760 6.7398 17.1107 26.6907 5.2779 1.3366 1.6544 16.4686
temp: 298.150 k
press: 1.00000 atm
elementType: 8 8 8 7 6 6 6 6 6 6 6 6 6 1 1 1 1 1 1 1 1 1 1 1
symmnumber: 1
zpe: 492201.4 jmol-1
zpe.correction: 0.187470 hartree
zpe.thermalcorrener: 0.200436 hartree
zpe.thermalcorrenthalpy: 0.201380 hartree
zpe.thermalcorrgfe: 0.146055 hartree
zpe.sumelectzpe: -628.962546 hartree
zpe.sumelectthermal: -628.949579 hartree
zpe.sumelectthermalent: -628.948635 hartree
zpe.sumelectthermalfe: -629.003960 hartree
dipole: 0.4757 2.1224 1.0890
dipole: 2.4324
quadrupole: -73.5777 -60.6676 -81.6766
quadrupole: -1.1291 -4.9393 -2.3723
quadrupole: -1.6037 11.3064 -9.7026 -1.1291 -4.9393 -2.3723
hfenergy: -629.1500152 hartree
pointgroup: C01 [X(C9H11N1O3)]
dipole: -0.1628732 -0.8086831 0.4851123 debye
dipolederiv: -0.3867383 0.2529609 0.0202777 0.2384233 -0.917953 -0.0282656 -0.0188195 0.001088 -0.2101385 -0.8265048 0.1125993 -0.5314827 0.1250269 -0.4504734 0.1147587 -0.534465 0.1019356 -0.8362665 -0.7596198 -0.0303264 0.246415 0.0312946 -0.3227523 0.1070829 -0.0125428 0.1218818 -0.924229 -0.2472936 0.0962594 0.0417151 -0.0252679 -0.0391323 0.0107136 0.049245 -0.041722 -0.0626193 0.0547447 0.0574957 0.0070172 0.0825015 0.1449528 -0.0099312 -0.0289999 -0.0145141 0.0995499 0.2326593 -0.017844 -0.0639536 0.1323199 -0.2581146 -0.0134091 -0.112751 0.0151742 -0.0832163 -0.3901545 -0.0015924 0.0813341 -0.0639981 0.1122698 0.052212 0.3195572 0.0548454 -0.0593598 0.1773652 -0.5804793 -0.0123549 -0.3539439 1.0089874 0.0372338 0.0127762 0.0724749 0.0590736 0.0097326 -0.0165937 -0.0648509 -0.0219228 0.0935595 -0.0212505 -0.0591253 -0.0160058 -0.1311773 -0.1586159 0.2483134 -0.0188172 0.025962 -0.1610752 -0.0127517 -0.0069582 -0.0588565 -0.163823 -0.1479522 -0.0561558 -0.011987 -0.1013096 -0.0151049 0.0066609 0.0032796 -0.0002814 -0.1767307 0.0891405 -0.0300313 -0.0792671 0.0620129 0.0943681 -0.0316237 -0.0772479 -0.0149372 -0.1364472 1.5021318 -0.0787621 0.1152725 -0.118502 0.2419076 -0.2588569 0.2095114 -0.2550975 1.4398456 0.0362226 0.0150369 0.0229238 0.03661 0.0156057 -0.1012918 0.0059637 -0.0727734 -0.0131909 0.0402166 -0.0195383 0.0099466 -0.0674608 -0.0929338 0.0902391 -0.0086469 0.0500851 0.0457726 0.0758953 0.0166439 -0.0018699 0.0073375 0.030093 -0.0995084 -0.0415105 -0.0705992 -0.0037851 0.1342748 -0.0035263 0.0152188 0.0339164 -0.0099851 0.0745309 0.008225 0.0564446 0.0765943 0.0356327 -0.0998707 0.0479405 -0.0827329 -0.0518657 0.037906 0.0433692 0.0485378 0.125891 0.079059 -0.0645145 0.027389 -0.0678733 0.0505521 0.0304141 0.0315425 0.0311022 0.1596774 0.0299037 0.0923544 0.0275206 0.1054202 -0.0845435 -0.0044721 0.0310647 -0.0018414 0.1603508 -0.1188245 0.0185779 0.0755306 0.0065276 0.0798313 0.0047967 0.0784855 -0.0012418 0.1350017 0.1318805 -0.0018326 0.0932322 -0.0133786 0.377689 0.0217927 0.1489152 0.0183617 0.2482435 0.2558226 0.0383997 0.0967799 -0.0004656 0.0685363 -0.0588712 0.0506293 -0.0290202 0.0736194 0.1510216 0.0524255 -0.1439301 0.0295028 0.0855814 0.0518907 -0.0914973 0.0049591 0.1773637 unknown
polarizability: 140.3625677|-6.1335493|122.7898477|-10.7875179|-5.7332207|75.8988111 unknown
InChI: InChI=1S/C9H11NO3/c10-13-8-4-2-1-3-7(8)5-6-9(11)12/h1-4,11H,5-6,10H2
charge 0 multiplicity 1
24 atoms
O  -0.505298 -1.788802 -0.091757
O  4.111697 -0.083864 1.192822
O  3.777923 0.38291 -1.056142
N  -1.317582 -3.020496 0.141804
C  0.900857 0.551627 -0.71319
C  -0.560764 0.59586 -0.298895
C  1.832468 0.211129 0.474885
C  -1.278519 -0.592685 0.01654
C  -1.266229 1.819009 -0.205032
C  -2.632924 -0.574046 0.402389
C  -2.625432 1.867376 0.184122
C  -3.305065 0.666627 0.486222
C  3.294003 0.190914 0.08118
H  1.056478 -0.204403 -1.504322
H  1.197376 1.52618 -1.139804
H  1.706333 0.935121 1.302077
H  1.57375 -0.779368 0.892868
H  -0.735391 2.74713 -0.450282
H  -3.130386 -1.521558 0.62165
H  -3.145532 2.829176 0.244467
H  -4.358824 0.688405 0.785905
H  5.063663 -0.088859 0.899935
H  -1.225229 -3.542256 -0.748098
H  -0.795074 -3.512826 0.887557
