program: Gaussian 09
title: 000170708
version: EM64L-G09RevD.01
frameworkgroup: C1[X(C17H25N)]
method: RPBEPBE
basis: SDD
operation: Freq
keyword: #pfreq=noraman
keyword: PBEPBE/SDD
title: #p freq=noraman PBEPBE/SDD
converged: YES YES NO NO
title: Mulliken charges:
elementType: N C C C C C C C C C C C C C C C C C H H H H H H H H H H H H H H H H H H H H H H H H H
charge: -0.224148 -0.390884 -0.362207 -0.436183 -0.388797 -0.372400 0.229216 -0.354278 0.385800 0.296075 -0.567703 -0.356281 -0.358584 -0.810458 -0.419007 -0.695853 -0.239292 -0.251505 0.209393 0.227630 0.192770 0.193021 0.221642 0.221217 0.197300 0.198624 0.190145 0.190901 0.188723 0.189686 0.257484 0.195118 0.194748 0.230980 0.230576 0.232726 0.248306 0.235239 0.215754 0.210337 0.209949 0.216759 0.217458
chargesum: 0.00000
title: Mulliken charges with hydrogens summed into heavy atoms:
elementType: N C C C C C C C C C C C C C C C C C
charge: -0.224148 0.046139 0.023583 0.006676 0.007127 0.008646 0.229216 0.024132 0.385800 0.296075 -0.310218 0.033586 -0.127604 -0.098850 -0.183767 -0.059813 -0.022533 -0.034047
polarizability: 2.31196682e+02 -1.88138419e+01 2.12450771e+02 -2.23217517e+01 -6.31206564e+00 1.32376252e+02
1716.lowfreq: -3.4120 -0.0006 -0.0006 0.0005 3.3656 9.1284 18.8643 33.5376 46.9987
frequency: 18.6378 33.4790 46.5653 50.8732 73.4469 95.3275 100.9106 123.3151 144.0098 147.4806 158.2374 161.9883 167.4724 235.3342 249.5898 260.1072 288.2525 293.6189 313.0371 385.1103 432.9279 436.0986 477.3144 484.7154 515.2378 576.8842 590.7741 621.2047 647.8086 721.4570 729.8378 740.0315 741.0157 748.4551 754.9618 786.0865 797.6738 832.9711 850.5710 859.8865 889.4526 902.9981 926.3702 942.8736 966.0617 985.8624 991.6855 1009.4143 1010.6546 1015.7365 1042.9495 1046.5964 1059.9311 1078.4101 1081.5607 1099.1700 1121.5812 1141.3535 1148.0769 1165.1356 1178.7215 1192.2363 1219.0495 1225.6217 1241.0862 1262.7914 1265.8249 1280.1327 1287.4283 1292.6675 1297.4813 1304.0819 1317.4827 1338.0161 1347.3513 1355.7936 1358.0628 1365.0104 1383.3739 1391.3603 1405.0062 1416.8238 1461.4785 1462.5160 1464.6192 1465.2061 1467.2576 1469.9046 1471.1874 1473.0517 1478.1048 1478.8601 1484.4114 1488.9967 1494.1176 1562.5982 1586.4636 1623.7162 2949.5525 2951.4625 2954.5475 2962.1291 2965.5613 2968.8127 2972.3441 2980.0503 2984.4275 2991.1404 2994.5283 3003.5746 3020.8806 3032.8493 3034.4496 3040.8402 3062.8127 3068.6796 3071.0340 3096.9162 3120.1109 3128.8229 3142.4405 3159.8324 3212.6776
redmass: 4.2131 4.0059 1.7796 2.7634 3.9093 1.5866 2.6829 3.1722 1.8540 2.0789 2.1791 2.0301 1.9424 1.1237 3.6312 3.2821 2.6122 3.0041 3.5790 4.0938 2.9684 2.9565 3.7119 4.2181 3.0397 3.9777 4.5335 4.0699 4.8766 1.0622 1.0801 2.1821 1.6496 1.2102 2.8242 1.2547 1.4182 2.0224 1.5270 1.7482 1.9125 2.5492 1.3849 1.3701 1.2987 3.5049 1.5551 1.4128 3.1692 1.7669 1.5471 2.8804 2.9134 2.3777 2.1959 2.2713 2.7185 1.9007 1.5151 1.1575 1.7479 1.7017 1.2891 1.6040 1.8668 1.2900 1.3038 1.0272 1.1956 1.1020 1.1397 1.3179 2.0353 1.4439 2.3855 1.6420 1.6087 1.4896 2.5770 1.2173 1.4548 3.3662 1.0795 1.0748 1.2849 1.8438 1.1186 1.1585 2.2583 1.2060 1.0470 1.1123 1.1200 1.1001 1.1464 5.6621 6.5498 7.4122 1.0588 1.0589 1.0591 1.0592 1.0394 1.0586 1.0368 1.0612 1.0958 1.0984 1.0613 1.1015 1.1033 1.1023 1.0977 1.1035 1.1039 1.1007 1.0993 1.0955 1.0844 1.0888 1.0952 1.1001 1.0978
irintensity: 0.2259 0.0421 0.0200 0.0360 0.0398 0.0010 0.0166 2.3484 0.0571 0.0583 1.3806 0.0119 1.2060 0.0021 0.3612 0.9051 0.2851 0.4261 0.4204 6.1873 4.9800 1.7739 1.2066 1.5013 1.8834 1.0317 3.8810 4.8145 3.1992 13.2935 0.2497 13.4209 38.2212 9.7804 23.2886 0.0246 51.6677 1.2505 5.1957 1.2033 5.0734 0.3366 4.1227 0.1859 0.1435 1.6710 3.7348 4.1415 1.1997 6.0520 3.2061 6.1592 3.8513 0.1078 0.1802 1.4604 12.1523 10.0099 6.2992 1.7694 6.1677 0.3102 11.7047 1.5122 4.4265 0.1214 0.7242 0.2166 3.2704 0.1012 0.4706 0.9724 18.2649 5.7356 36.3923 1.5059 0.1654 21.3718 46.2186 11.2998 33.0498 34.5057 1.2991 0.0960 13.5430 28.9674 2.4683 10.9456 16.4828 2.1710 10.0130 3.2953 4.7269 14.5418 26.3341 24.1151 4.7707 4.7169 5.4381 4.9753 0.4198 28.0059 50.1324 132.5045 34.8362 12.7944 1.2995 1.5401 71.6179 1.1073 0.2654 13.5900 23.4085 101.7012 58.1891 96.6218 55.3221 17.6846 1.3701 6.1769 45.5706 33.1658 5.6399
temp: 298.150 k
press: 1.00000 atm
elementType: 7 6 6 6 6 6 6 6 6 6 6 6 6 6 6 6 6 6 1 1 1 1 1 1 1 1 1 1 1 1 1 1 1 1 1 1 1 1 1 1 1 1 1
symmnumber: 1
zpe: 991985.1 jmol-1
zpe.correction: 0.377827 hartree
zpe.thermalcorrener: 0.397114 hartree
zpe.thermalcorrenthalpy: 0.398058 hartree
zpe.thermalcorrgfe: 0.328071 hartree
zpe.sumelectzpe: -716.200615 hartree
zpe.sumelectthermal: -716.181329 hartree
zpe.sumelectthermalent: -716.180385 hartree
zpe.sumelectthermalfe: -716.250372 hartree
dipole: -2.7375 1.6341 0.6675
dipole: 3.2573
quadrupole: -119.0839 -103.4387 -113.6552
quadrupole: 2.9401 -3.5722 -1.7687
quadrupole: -7.0247 8.6206 -1.5959 2.9401 -3.5722 -1.7687
hfenergy: -716.5784427 hartree
pointgroup: C01 [X(C17H25N1)]
dipole: -1.0952819 0.5992771 0.2889162 debye
polarizability: 232.2879196|-17.2435839|211.8386646|-22.8716868|-3.447936|131.8971211 unknown
InChI: InChI=1S/C17H25N/c1-3-4-5-6-7-10-13-18-15(2)14-16-11-8-9-12-17(16)18/h8-9,11-12,14H,3-7,10,13H2,1-2H3
charge 0 multiplicity 1
43 atoms
N  1.792186 0.839037 0.450439
C  -0.668968 0.427309 0.069466
C  -2.057981 0.402424 0.743978
C  0.455178 0.819553 1.05923
C  -3.190382 -0.019627 -0.219165
C  -4.585375 -0.025426 0.445623
C  2.585369 -0.298037 0.225933
C  -5.717553 -0.465228 -0.509656
C  2.453001 1.968004 -0.087488
C  3.781419 0.128969 -0.456203
C  3.668688 1.559518 -0.640268
C  -7.113871 -0.458142 0.153446
C  2.356912 -1.649367 0.569631
C  1.861949 3.347027 -0.003731
C  4.764562 -0.838412 -0.792411
C  -8.239632 -0.902347 -0.805318
C  3.351188 -2.588571 0.223959
C  4.542064 -2.187375 -0.450662
H  -0.674439 1.142994 -0.776643
H  -0.441889 -0.567282 -0.361593
H  -2.287323 1.406466 1.159539
H  -2.03731 -0.294306 1.608646
H  0.466339 0.109813 1.909284
H  0.245179 1.818859 1.481836
H  -3.203572 0.664712 -1.092983
H  -2.970706 -1.030605 -0.620875
H  -4.809611 0.989645 0.835793
H  -4.568445 -0.699873 1.327544
H  -5.731533 0.202601 -1.396586
H  -5.500434 -1.48439 -0.892653
H  4.392992 2.217392 -1.118035
H  -7.098788 -1.123288 1.041099
H  -7.331076 0.561198 0.533348
H  1.444494 -1.968743 1.085548
H  0.863664 3.407586 -0.479001
H  1.752885 3.692986 1.043028
H  2.521987 4.061669 -0.521443
H  5.683485 -0.540086 -1.309744
H  -9.226391 -0.888684 -0.306849
H  -8.062463 -1.929799 -1.175714
H  -8.296875 -0.234888 -1.685995
H  3.205623 -3.644944 0.476888
H  5.292653 -2.944339 -0.704945
