program: Gaussian 09
title: 000013180
version: EM64L-G09RevD.01
frameworkgroup: C1[X(C4H6Br2)]
method: RPBEPBE
basis: SDD
operation: Freq
keyword: #pfreq=noraman
keyword: PBEPBE/SDD
title: #p freq=noraman PBEPBE/SDD
converged: YES YES NO NO
title: Mulliken charges:
elementType: Br Br C C C C H H H H H H
charge: -0.024197 -0.024352 -0.051304 -0.050956 -0.741641 -0.741525 0.244900 0.244953 0.291923 0.280129 0.280106 0.291965
chargesum: 0.00000
title: Mulliken charges with hydrogens summed into heavy atoms:
elementType: Br Br C C C C
charge: -0.024197 -0.024352 0.193596 0.193998 -0.169590 -0.169455
polarizability: 1.23521374e+02 2.49565392e-02 7.45100161e+01 -6.59461584e+00 -1.04575626e-02 4.45589396e+01
1716.lowfreq: -2.7453 -2.5269 -0.0004 -0.0002 0.0002 13.4208 32.4085 91.1204 130.4848
frequency: 32.4079 91.1201 130.4549 209.5107 264.2008 301.4647 490.1649 511.1595 576.1556 844.4635 844.7098 888.2956 967.9306 1051.4561 1092.6339 1117.3694 1180.9685 1199.6053 1210.9075 1298.2060 1312.7073 1449.1512 1452.4963 1656.5749 3062.6829 3063.2725 3114.2949 3121.0249 3152.2113 3153.8172
redmass: 18.2513 3.0247 4.2573 2.1785 7.5018 2.7976 2.6705 4.3143 5.2806 1.5956 1.5249 1.5846 1.1258 1.4174 1.0657 3.8728 1.6026 1.1425 1.1649 1.2691 1.2644 1.1225 1.1413 5.8884 1.0567 1.0569 1.0959 1.0896 1.1117 1.1087
irintensity: 0.1473 0.6717 1.4765 15.3556 1.5950 22.7282 2.5042 44.7163 46.8723 2.3072 5.0456 4.5074 47.6822 12.7159 0.9321 50.5638 1.9973 26.8813 28.3432 0.3674 15.6043 5.2862 10.9702 0.1010 10.6648 19.4215 0.3313 12.7262 0.6127 15.6755
temp: 298.150 k
press: 1.00000 atm
elementType: 35 35 6 6 6 6 1 1 1 1 1 1
symmnumber: 1
zpe: 232323.3 jmol-1
zpe.correction: 0.088487 hartree
zpe.thermalcorrener: 0.096072 hartree
zpe.thermalcorrenthalpy: 0.097016 hartree
zpe.thermalcorrgfe: 0.052720 hartree
zpe.sumelectzpe: -182.450480 hartree
zpe.sumelectthermal: -182.442895 hartree
zpe.sumelectthermalent: -182.441951 hartree
zpe.sumelectthermalfe: -182.486247 hartree
dipole: 0.0012 3.7714 0.0006
dipole: 3.7714
quadrupole: -63.6368 -51.5182 -53.0615
quadrupole: 0.0025 0.7468 -0.0043
quadrupole: -7.5646 4.5540 3.0107 0.0025 0.7468 -0.0043
hfenergy: -182.538967 hartree
pointgroup: C01 [X(C4H6Br2)]
dipole: 0.0003988 1.4836841 0.0171218 debye
dipolederiv: -0.5962139 -0.1431966 -0.0086706 -0.5238689 -0.3739961 0.0015559 -0.017729 0.0330659 -0.1502489 -0.5957125 0.1437945 -0.0054357 0.5242015 -0.3738102 -0.0066291 -0.0055514 -0.0382087 -0.1512258 -0.1667762 0.0191909 -0.0072069 0.1633885 -0.2917556 -0.021176 -0.0422108 0.1176608 0.1299982 -0.166354 -0.0191758 -0.0076789 -0.1616137 -0.2890816 0.0123141 -0.0455156 -0.1261328 0.1273115 0.7201599 0.2923169 -0.0474275 0.4756717 0.5958376 -0.0463566 0.1172971 -0.0738661 0.0883216 0.719289 -0.2915611 -0.0539569 -0.4789731 0.5934286 0.0578591 0.106158 0.0849541 0.0914643 0.0473306 -0.0134523 -0.0321578 0.0337906 0.1518036 0.013825 -0.0536662 -0.0013682 -0.0861181 0.0473387 0.0143002 -0.0318838 -0.0326702 0.1518826 -0.0089065 -0.0543671 0.0061599 -0.0861349 -0.046687 0.0022266 0.0278425 -0.0224569 -0.0839002 -0.028541 0.0289891 -0.0420055 0.0857669 0.0421544 -0.0762609 0.06855 -0.0565418 0.0012684 0.0645099 -0.0319905 0.0444244 -0.0670025 0.0423406 0.0746632 0.0702043 0.0569825 0.0036729 -0.0630469 -0.0308405 -0.0427254 -0.0694089 -0.0468695 -0.0028455 0.0278214 0.0220898 -0.08535 0.024592 0.0294268 0.0380415 0.0872766 unknown
polarizability: 123.7762554|0.002149|74.5056311|-4.8267062|0.3660835|44.3084434 unknown
InChI: InChI=1S/C4H6Br2/c5-3-1-2-4-6/h1-2H,3-4H2
charge 0 multiplicity 1
12 atoms
Br -2.895106 -1.214509 -0.048769
Br 2.902157 -1.218349 0.013792
C  -0.586577 0.549558 0.345043
C  0.5944 0.555477 -0.338993
C  -1.917227 0.584664 -0.322699
C  1.925095 0.574812 0.329131
H  -0.583843 0.519835 1.443175
H  0.59149 0.547871 -1.437513
H  -2.617505 1.305719 0.1235
H  -1.860085 0.705247 -1.413986
H  1.868329 0.670216 1.422932
H  2.625872 1.305257 -0.100715
