program: Gaussian 09
title: 000170716
version: EM64L-G09RevD.01
frameworkgroup: C1[X(C20H12ClNO4)]
method: RPBEPBE
basis: SDD
operation: Freq
keyword: #p
keyword: freq=noraman
keyword: PBEPBE/SDD
title: #p freq=noraman PBEPBE/SDD
converged: YES YES NO NO
title: Mulliken charges:
elementType: Cl O O O O N C C C C C C C C C C C C C C C C C C C C H H H H H H H H H H H H
charge: -0.040966 -0.327292 -0.361884 -0.302187 -0.176683 -0.646384 0.233004 0.213605 0.271080 0.255664 -0.124671 0.052680 -0.217874 0.126700 0.202763 -0.571044 -0.380039 -0.382298 -0.231809 -0.228288 0.361675 -0.345010 -0.371570 -0.180338 -0.173411 -0.125047 0.261507 0.289764 0.291945 0.236218 0.236349 0.334206 0.388681 0.357100 0.279660 0.268098 0.263042 0.263051
chargesum: 0.00000
title: Mulliken charges with hydrogens summed into heavy atoms:
elementType: Cl O O O O N C C C C C C C C C C C C C C C C C C C C
charge: -0.040966 -0.327292 -0.004784 -0.302187 -0.176683 0.076503 0.233004 0.213605 0.271080 0.255664 -0.124671 0.052680 -0.217874 0.126700 0.202763 -0.309537 -0.090275 -0.090354 0.004410 0.008062 0.361675 -0.065349 -0.103471 0.082704 0.089641 -0.125047
polarizability: 5.00083252e+02 2.30516275e-03 2.41523242e+02 2.05218524e+01 6.78946118e+00 1.25732887e+02
1716.lowfreq: -3.5665 -2.2125 -0.0014 0.0007 0.0010 3.4360 13.0785 26.7887 41.2165
frequency: 13.0625 26.7867 41.2036 42.7283 66.7163 106.7602 113.0876 137.2784 160.5734 161.9082 198.9733 207.8705 242.3031 271.8284 289.8906 300.1860 330.3941 352.9171 359.0824 374.9051 385.1068 389.3515 413.5972 415.1809 422.0433 435.0103 443.1790 452.6085 486.2395 493.8908 503.6910 520.0180 559.9729 588.4161 609.4982 625.1874 630.9831 646.3667 676.7643 686.5447 700.1978 720.2953 731.7802 743.3365 792.9510 811.3321 816.6278 821.8799 829.5481 832.4596 844.9583 864.5771 879.3438 924.8252 936.4289 946.7219 960.9218 990.8036 996.8568 998.0257 1014.2747 1030.8274 1068.3581 1080.2950 1093.3695 1101.7384 1137.2865 1159.3375 1167.4675 1170.8257 1185.1321 1197.2475 1243.1062 1265.6420 1283.5487 1286.0703 1312.5619 1344.0002 1367.7883 1388.4679 1396.7076 1398.4747 1411.5946 1443.2150 1450.5163 1465.9579 1470.5564 1519.3346 1536.3599 1549.9542 1571.8407 1587.0959 1593.3640 1599.0635 1610.7992 1631.1894 3131.0902 3133.3816 3150.3225 3157.7349 3163.3588 3164.2726 3171.4942 3177.7668 3183.1767 3295.8474 3526.7244 3624.0605
redmass: 8.3014 7.1019 7.4480 5.4510 7.2412 5.4775 7.8371 6.4055 8.8666 8.1165 6.7350 6.2270 6.7826 5.1860 6.6704 6.4676 5.3249 8.6668 1.1812 6.8325 8.5575 7.4865 3.0543 7.4889 3.5623 6.0357 7.2978 6.0918 5.8320 4.2380 3.5364 6.0388 1.2227 5.8464 6.7774 5.7899 6.6370 6.6953 5.7492 5.2589 4.6536 5.8339 3.7536 2.8810 5.1923 1.8961 1.3147 1.1349 1.9080 3.5665 1.4879 2.7016 7.5982 5.2422 1.9891 1.3418 1.3498 4.1488 3.7232 1.3885 1.3593 2.1138 2.7477 3.3959 2.4474 1.2983 1.8456 1.5514 1.2336 1.1716 1.9041 3.2504 1.7755 2.2951 1.3471 3.1680 3.9926 3.8764 6.7307 7.5292 5.9543 4.6511 3.3334 2.8825 3.9608 2.4001 2.6926 8.2759 4.9461 2.1770 5.0354 7.1775 5.6530 6.6779 6.7404 7.9389 1.0914 1.0862 1.0906 1.0891 1.0944 1.0891 1.0995 1.0970 1.0980 1.0606 1.0657 1.0906
irintensity: 0.2859 0.6962 5.6865 2.1249 0.6788 1.4658 0.2628 0.3760 1.4073 0.1387 0.5036 1.7973 6.3440 9.9406 1.3162 3.0879 1.6578 12.1523 86.6865 5.0155 5.0742 9.5750 2.7166 38.4999 0.4880 6.4500 16.3612 13.4378 11.2361 8.0660 2.3435 4.6536 154.8435 0.9008 29.3583 16.3608 10.8755 17.2051 3.7000 1.1651 6.4192 4.7601 8.3969 23.7849 7.7664 71.0814 5.4086 102.2769 49.6322 51.9496 16.9789 0.0425 14.5816 36.7530 0.0943 1.1367 0.1978 54.6837 54.7938 4.7939 0.0441 22.3103 110.7767 70.5204 103.7353 14.8936 27.3850 47.4691 78.9702 33.8516 24.1500 423.7165 99.7009 202.2678 40.7199 495.8757 325.9788 67.1961 0.8726 28.3771 32.6941 13.2598 89.2304 4.1255 100.9323 294.6808 5.8053 4.1660 671.5955 10.9778 47.9708 1.8554 15.5681 9.9656 0.9048 12.4678 5.3492 4.7165 12.8208 4.8090 3.3032 2.9807 36.4792 1.2782 0.5516 67.9189 30.5443 119.5608
temp: 298.150 k
press: 1.00000 atm
elementType: 17 8 8 8 8 7 6 6 6 6 6 6 6 6 6 6 6 6 6 6 6 6 6 6 6 6 1 1 1 1 1 1 1 1 1 1 1 1
symmnumber: 1
zpe: 707821.9 jmol-1
zpe.correction: 0.269595 hartree
zpe.thermalcorrener: 0.290610 hartree
zpe.thermalcorrenthalpy: 0.291554 hartree
zpe.thermalcorrgfe: 0.217950 hartree
zpe.sumelectzpe: -1583.279921 hartree
zpe.sumelectthermal: -1583.258906 hartree
zpe.sumelectthermalent: -1583.257962 hartree
zpe.sumelectthermalfe: -1583.331566 hartree
dipole: -3.2330 -1.5636 -0.2955
dipole: 3.6034
quadrupole: -145.8712 -160.9682 -153.1094
quadrupole: -4.7253 7.3820 3.0767
quadrupole: 7.4451 -7.6519 0.2069 -4.7253 7.3820 3.0767
hfenergy: -1583.549516 hartree
pointgroup: C01 [X(C20H12Cl1N1O4)]
dipole: 1.2982396 -0.5340956 0.1979304 debye
polarizability: 500.0241778|13.6820392|236.4011426|14.5332186|-25.6416218|130.9140603 unknown
InChI: InChI=1S/C20H12ClNO4/c21-10-5-7-11(8-6-10)26-15-9-14(23)16-17(18(15)22)20(25)13-4-2-1-3-12(13)19(16)24/h1-9,23H,22H2
charge 0 multiplicity 1
38 atoms
Cl 7.927444 0.934912 -0.897489
O  2.448332 -1.074957 0.609007
O  -0.183079 3.02122 -0.01341
O  -2.326269 -2.731165 0.252445
O  -2.794827 2.754464 -0.29377
N  0.244497 -2.570795 0.482646
C  -1.201775 -0.586822 0.172728
C  -1.310563 0.85334 0.037102
C  -3.72791 -0.808007 -0.049511
C  -3.843825 0.601498 -0.187552
C  -2.399712 -1.444474 0.132376
C  0.079565 -1.216448 0.347993
C  -2.641141 1.497285 -0.155484
C  -0.12146 1.630641 0.095802
C  1.243935 -0.373749 0.381718
C  1.149404 1.008955 0.268208
C  -4.890382 -1.621101 -0.086673
C  -5.124376 1.18404 -0.361314
C  -6.15781 -1.034802 -0.258821
C  -6.274986 0.373528 -0.396763
C  3.703481 -0.518257 0.238253
C  3.924836 0.028441 -1.046479
C  4.750263 -0.638857 1.175231
C  5.218637 0.4751 -1.391664
C  6.046612 -0.197507 0.82855
C  6.260074 0.357891 -0.448501
H  2.056698 1.622445 0.32185
H  -4.766289 -2.70276 0.021626
H  -5.181755 2.272008 -0.465328
H  -7.054147 -1.663777 -0.286832
H  -7.262097 0.829208 -0.530959
H  1.181866 -2.946439 0.611916
H  -0.618347 -3.138651 0.45267
H  0.726416 3.411302 0.061497
H  3.109042 0.092249 -1.772827
H  4.547829 -1.075301 2.157218
H  5.412398 0.895904 -2.382189
H  6.871019 -0.282961 1.541731
