program: Gaussian 09
title: 000170687
version: EM64L-G09RevD.01
frameworkgroup: C1[X(C14H26O)]
method: RPBEPBE
basis: SDD
operation: Freq
keyword: #pfreq=noraman
keyword: PBEPBE/SDD
title: #p freq=noraman PBEPBE/SDD
converged: YES YES NO NO
title: Mulliken charges:
elementType: O C C C C C C C C C C C C C C H H H H H H H H H H H H H H H H H H H H H H H H H H
charge: -0.234521 -0.107422 -0.107352 -0.443444 -0.443535 -0.358346 -0.358293 -0.388011 -0.388012 -0.375526 -0.375551 -0.392304 -0.392302 -0.388756 -0.388763 0.209069 0.209082 0.220684 0.189832 0.220611 0.189848 0.210212 0.192198 0.210166 0.192272 0.187835 0.200716 0.187849 0.200720 0.199611 0.183876 0.199615 0.183877 0.189455 0.194484 0.189455 0.194481 0.189098 0.204002 0.189090 0.204000
chargesum: 0.00000
title: Mulliken charges with hydrogens summed into heavy atoms:
elementType: O C C C C C C C C C C C C C C
charge: -0.234521 0.101647 0.101730 -0.032928 -0.033076 0.044064 0.044145 0.000540 0.000558 0.007960 0.007940 -0.008365 -0.008366 0.004345 0.004326
polarizability: 1.63438534e+02 -2.18308978e-03 1.50861713e+02 2.53283780e-03 -1.83391185e+00 1.25455999e+02
1716.lowfreq: -58.5521 -24.7360 -14.6574 -6.9830 0.0004 0.0005 0.0008 41.7662 48.4333
frequency: -58.5398 40.4806 48.4311 121.1799 129.2581 160.1396 181.6427 193.8187 209.2992 236.5742 257.6462 279.8332 282.4029 287.7206 307.6941 336.6831 375.5621 445.8970 457.9358 508.1656 517.0762 681.1866 688.0842 706.0928 727.5966 735.5452 766.7683 783.8912 804.2068 825.7772 830.8915 853.8717 869.9371 906.0691 906.6585 945.0162 950.5538 966.4930 978.8851 993.5499 1009.4508 1032.7322 1043.3232 1053.9551 1065.5123 1073.3939 1081.9849 1086.2933 1099.2979 1115.2158 1125.7326 1140.7688 1143.7006 1166.7446 1168.8383 1177.7129 1177.7809 1221.5765 1234.1000 1235.4814 1262.4101 1273.2539 1275.4228 1285.0157 1287.2909 1299.6572 1301.0234 1307.0621 1318.9525 1323.3659 1328.4822 1334.6605 1341.7711 1344.7264 1349.2159 1354.6896 1355.9463 1359.5214 1359.9568 1460.7943 1461.0454 1461.7973 1462.9004 1462.9286 1463.6524 1475.5213 1475.7254 1482.5876 1490.2323 1492.7042 1497.7109 2958.7929 2958.8891 2960.7919 2961.1296 2962.8488 2968.0296 2969.4486 2970.7015 2973.9856 2974.3179 2977.8479 2981.5417 3004.6476 3004.8922 3007.2444 3008.5663 3012.4093 3018.0484 3024.3746 3031.1466 3031.3132 3033.8723 3034.9316 3036.0639 3038.3143 3043.1470
redmass: 4.3725 3.0302 3.0445 2.8675 3.1258 2.4018 3.2915 2.0432 2.7794 1.8344 2.4267 1.7522 2.4399 2.2646 1.9508 2.2547 2.2234 2.1951 2.7496 2.8492 2.5913 1.3356 1.9289 4.8134 1.6058 1.6436 1.7784 1.9112 1.7348 3.2641 2.1257 2.6657 1.7746 1.9367 2.2658 2.6389 1.8385 1.5783 1.8806 1.5754 2.3467 3.1925 1.5741 2.3763 2.1763 1.7806 2.0507 1.7236 1.8283 2.1333 1.5084 1.3620 1.2704 1.3619 1.5419 1.3363 1.4011 1.4756 1.4340 1.3493 1.2122 1.2809 1.4525 1.3977 1.2006 1.1656 1.2633 1.2209 1.2377 1.2520 1.1491 1.3898 1.4253 1.4563 1.5068 1.4117 1.4497 1.3359 1.4963 1.0777 1.0842 1.0806 1.0837 1.0872 1.0718 1.0925 1.0946 1.0726 1.0839 1.0922 1.0877 1.0599 1.0595 1.0605 1.0600 1.0610 1.0613 1.0652 1.0620 1.0619 1.0619 1.0622 1.0618 1.0972 1.0971 1.0976 1.0917 1.0961 1.0986 1.0969 1.0974 1.0995 1.0974 1.0988 1.1023 1.0982 1.0997
irintensity: 8.0580 0.6271 0.0228 0.3638 0.0028 0.0006 0.3202 0.0498 0.0503 0.0434 0.2277 0.6731 0.3997 0.0177 0.4636 0.0031 0.3257 0.9844 0.5032 1.3930 1.4158 2.8011 10.1268 1.8678 16.3521 12.8531 0.2837 0.2946 3.2852 18.3808 0.1399 3.6155 10.6631 0.1532 1.4473 18.8453 0.0015 4.3298 0.1877 4.6996 9.9605 26.4300 0.0044 10.4358 1.1481 4.2478 0.1036 1.3129 1.5174 0.0603 2.3736 1.4365 2.7486 1.0614 0.9995 0.1718 0.5661 8.4432 4.6716 7.8615 2.5433 0.2518 4.0449 3.1649 0.8800 0.1083 0.1923 0.1256 5.2010 1.3346 0.6604 1.0299 1.2844 0.9026 0.5455 0.0803 1.0996 0.7944 0.0032 5.2815 17.3790 3.5652 10.5162 1.6112 2.3193 3.6718 3.5630 0.1023 7.1051 34.7876 7.3925 45.0756 31.5640 7.2068 29.6523 132.5502 7.7640 32.1479 60.1906 51.2349 1.3831 33.3959 9.7787 22.0878 8.5715 6.4146 7.5319 0.5387 2.3012 25.0363 118.7563 3.6700 0.3460 117.4324 293.7161 126.2935 41.7323
temp: 298.150 k
press: 1.00000 atm
elementType: 8 6 6 6 6 6 6 6 6 6 6 6 6 6 6 1 1 1 1 1 1 1 1 1 1 1 1 1 1 1 1 1 1 1 1 1 1 1 1 1 1
symmnumber: 1
zpe: 983626.0 jmol-1
zpe.correction: 0.374643 hartree
zpe.thermalcorrener: 0.389372 hartree
zpe.thermalcorrenthalpy: 0.390316 hartree
zpe.thermalcorrgfe: 0.333466 hartree
zpe.sumelectzpe: -623.059255 hartree
zpe.sumelectthermal: -623.044526 hartree
zpe.sumelectthermalent: -623.043582 hartree
zpe.sumelectthermalfe: -623.100432 hartree
dipole: 2.6891 -0.0009 -0.0014
dipole: 2.6891
quadrupole: -111.4708 -92.6493 -92.8472
quadrupole: 0.0023 0.0072 -0.9082
quadrupole: -12.4816 6.3398 6.1419 0.0023 0.0072 -0.9082
hfenergy: -623.433898 hartree
pointgroup: C01 [X(C14H26O1)]
dipole: -1.0579623 0.0012967 -0.0006347 debye
polarizability: 163.4385204|-0.0135796|150.8692485|0.0024726|1.7810373|125.448478 unknown
InChI: InChI=1S/C14H26O/c1-2-4-6-8-10-14-12-15-11-13(14)9-7-5-3-1/h13-14H,1-12H2
charge 0 multiplicity 1
41 atoms
O  3.830107 -0.003505 0.001311
C  1.515804 -0.598972 -0.505347
C  1.516245 0.596627 0.505493
C  1.1747 -1.96693 0.148942
C  1.177235 1.964977 -0.14907
C  2.959859 -0.55652 -1.065548
C  2.959908 0.552447 1.066732
C  -0.286313 -2.101123 0.651053
C  -0.283569 2.101267 -0.651224
C  -1.342788 -2.157193 -0.481782
C  -1.339893 2.159596 0.481632
C  -2.806152 -1.972922 0.003956
C  -2.803571 1.977224 -0.003883
C  -3.127699 -0.552341 0.5434
C  -3.127202 0.557022 -0.543069
H  0.799781 -0.409995 -1.326196
H  0.799444 0.408569 1.325871
H  1.873501 -2.145763 0.991132
H  1.371436 -2.769914 -0.591783
H  1.876327 2.142597 -0.991281
H  1.375148 2.767815 0.591498
H  3.344521 -1.559204 -1.329435
H  3.032596 0.100132 -1.956415
H  3.345937 1.554871 1.329678
H  3.031025 -0.103213 1.958438
H  -0.516626 -1.259902 1.333646
H  -0.37455 -3.020244 1.265262
H  -0.515268 1.260073 -1.333372
H  -0.37035 3.020219 -1.265897
H  -1.252858 -3.130875 -1.005169
H  -1.116795 -1.384922 -1.243202
H  -1.248482 3.133455 1.004431
H  -1.115001 1.387458 1.243515
H  -3.016707 -2.719319 0.79771
H  -3.496469 -2.204536 -0.833269
H  -3.013213 2.723767 -0.797742
H  -3.493438 2.209957 0.833404
H  -2.399115 -0.298516 1.337269
H  -4.117398 -0.569402 1.042193
H  -2.399317 0.302177 -1.337255
H  -4.117098 0.575361 -1.04143
