program: Gaussian 09
title: 000170668
version: EM64L-G09RevD.01
frameworkgroup: C1[X(C6H5BrN4)]
method: RPBEPBE
basis: SDD
operation: Freq
keyword: #p
keyword: freq=noraman
keyword: PBEPBE/SDD
title: #p freq=noraman PBEPBE/SDD
converged: NO YES NO NO
title: Mulliken charges:
elementType: Br N N N N C C C C C C H H H H H
charge: 0.046635 0.002097 -0.668421 -0.633693 -0.043388 0.387217 -0.461917 0.361924 0.202470 -0.493149 -0.253221 0.221146 0.354178 0.318595 0.341271 0.318256
chargesum: 0.00000
title: Mulliken charges with hydrogens summed into heavy atoms:
elementType: Br N N N N C C C C C C
charge: 0.046635 0.002097 0.004352 0.025834 -0.043388 0.387217 -0.240772 0.361924 0.202470 -0.493149 -0.253221
polarizability: 1.50260620e+02 -1.68093470e+01 1.49160269e+02 8.60253974e-03 -3.43966386e-03 4.14154929e+01
1716.lowfreq: -7.2859 -1.7231 -1.0673 -0.0006 -0.0002 -0.0001 68.9540 114.7271 154.6305
frequency: 68.9438 114.7251 154.6293 187.0596 201.8633 246.4629 255.0615 328.0290 409.6785 418.9707 433.8295 446.2285 504.4844 514.3816 523.9560 540.2409 580.8935 608.8762 678.9942 697.8217 747.4526 833.1843 842.1490 950.6929 1018.2575 1076.1899 1179.7887 1256.5812 1311.8475 1375.7929 1464.2978 1487.7937 1537.0363 1611.4590 1627.2702 1646.7401 2158.0069 3148.5135 3537.2790 3553.7584 3684.1704 3707.7751
redmass: 7.2534 16.0997 6.7285 6.7660 4.0914 6.8331 8.4795 3.6356 1.1681 7.3576 1.1525 4.5077 1.2335 2.5957 1.4402 6.2273 4.4734 5.4222 8.7747 6.8114 3.5766 1.8711 7.9623 4.8868 1.5847 1.3428 6.1043 1.7237 6.4374 6.7507 5.6733 4.6471 5.1821 1.7966 2.5118 1.2712 12.5948 1.0924 1.0468 1.0452 1.1031 1.1048
irintensity: 2.1517 3.0309 8.2601 1.1517 3.5936 3.4923 12.3421 0.5612 141.6632 2.1089 29.4986 0.4023 314.1115 91.7221 24.8908 4.9986 9.7261 1.8823 2.0589 0.0657 0.4384 61.1615 76.4684 12.2193 23.6524 1.1787 31.3650 51.9727 56.7639 89.1715 2.9884 215.0858 185.0251 34.5133 866.2415 257.8070 90.7556 14.0390 88.2753 131.1898 35.8980 40.9088
temp: 298.150 k
press: 1.00000 atm
elementType: 35 7 7 7 7 6 6 6 6 6 6 1 1 1 1 1
symmnumber: 1
zpe: 285136.9 jmol-1
zpe.correction: 0.108603 hartree
zpe.thermalcorrener: 0.119016 hartree
zpe.thermalcorrenthalpy: 0.119961 hartree
zpe.thermalcorrgfe: 0.071949 hartree
zpe.sumelectzpe: -463.333928 hartree
zpe.sumelectthermal: -463.323514 hartree
zpe.sumelectthermalent: -463.322570 hartree
zpe.sumelectthermalfe: -463.370582 hartree
dipole: 7.9833 -1.5900 0.0053
dipole: 8.1401
quadrupole: -53.2857 -69.5955 -76.4880
quadrupole: 4.5783 0.0364 -0.0292
quadrupole: 13.1707 -3.1391 -10.0316 4.5783 0.0364 -0.0292
hfenergy: -463.4425306 hartree
pointgroup: C01 [X(C6H5Br1N4)]
dipole: -2.4241524 2.0918047 -0.0644546 debye
dipolederiv: -0.2137311 0.333989 -0.0055154 0.3323206 -0.6819606 0.0104869 -0.0058034 0.0111705 -0.0377325 -1.6988805 0.4621808 -0.0351445 0.42859 -0.6251577 0.0114149 -0.0348607 0.0113706 -0.2200301 -0.4300019 -0.5221001 0.0076721 -0.419505 -1.1893069 -0.0075354 0.0074011 -0.0101073 -0.6727148 -1.7635064 -0.1887406 -0.0212308 -0.133238 -0.2093649 -0.0060554 -0.0221612 -0.0074096 -0.7171872 -0.6559904 -0.0723885 -0.0081797 -0.0931709 -0.2651414 -0.0019614 -0.0080881 -0.0015283 -0.2594282 0.9588764 0.4018122 0.0148665 0.1892139 1.3342408 -0.0003774 0.0152994 0.003925 0.1793124 -0.8045447 -0.3749844 -0.010113 -0.4563383 -0.3741971 -0.0093464 -0.0098812 -0.0073877 -0.288421 -0.7154016 0.1885909 -0.0169842 -0.0759864 -0.8078547 0.0020847 -0.0157934 0.0079427 0.0296334 2.1591572 0.0937811 0.0432926 0.0520928 0.7074297 -0.0005892 0.0458265 0.0011717 0.2189145 1.4711113 -0.5931881 0.035702 -0.1283779 1.4108644 -0.0098135 0.0336405 -0.0207831 -0.0103781 0.8173527 0.0938276 0.0160631 0.0917161 -0.0143268 0.0020595 0.0161987 0.00238 0.0463602 0.0092983 0.0618864 -0.0040987 0.1015986 -0.0851529 0.0031972 -0.0044465 0.0022845 0.1966355 0.197697 0.0630923 -0.0041571 0.0306157 0.23824 0.0014548 -0.0039705 0.0020501 0.3768499 0.1317753 0.0196492 -0.0055648 0.0450502 0.2395986 0.0017382 -0.0054749 0.0017588 0.3779627 0.2712387 0.0260204 -0.0032973 0.0922132 0.2016248 0.002983 -0.0036834 0.0015482 0.3888104 0.2655499 0.0065718 -0.0033109 -0.0567946 0.1204648 0.0002596 -0.0042028 0.0016139 0.3914129 unknown
polarizability: 165.8196755|-4.6156489|133.5388829|2.7408313|-0.5246463|41.4778228 unknown
InChI: InChI=1S/C6H5BrN4/c7-6-3(2-8)4(9)1-5(10)11-6/h1H,9-10H2
charge 0 multiplicity 1
16 atoms
Br 0.963739 -2.855926 0.021176
N  -1.319791 -1.200326 -0.036791
N  0.707765 2.505035 -0.008371
N  -3.397608 -0.156629 -0.088373
N  3.388211 0.242223 0.057582
C  0.028536 1.305388 -0.017742
C  -1.386293 1.24972 -0.047712
C  0.773162 0.061305 0.002865
C  -2.027138 -0.014751 -0.056143
C  0.007464 -1.13519 -0.009104
C  2.196675 0.108837 0.032935
H  -1.976318 2.171339 -0.063355
H  1.726567 2.522195 0.013707
H  0.206665 3.388922 -0.024418
H  -3.778425 -1.100529 -0.093228
H  -4.021111 0.644687 -0.109027
