program: Gaussian 09
title: 000170659
version: EM64L-G09RevD.01
frameworkgroup: C1[X(C13H20O)]
method: RPBEPBE
basis: SDD
operation: Freq
keyword: #pfreq=noraman
keyword: PBEPBE/SDD
title: #p freq=noraman PBEPBE/SDD
converged: YES YES NO NO
title: Mulliken charges:
elementType: O C C C C C C C C C C C C C H H H H H H H H H H H H H H H H H H H H
charge: -0.187341 -0.121450 -0.146514 -0.518475 -0.198090 0.439169 -0.419153 -0.745973 -0.329083 -0.128599 -0.844600 0.357726 -0.783208 -0.795922 0.239640 0.208995 0.236225 0.218182 0.201649 0.225728 0.219334 0.224531 0.219055 0.244286 0.165262 0.220624 0.231822 0.226590 0.231518 0.215628 0.219683 0.223905 0.224441 0.224414
chargesum: 0.00000
title: Mulliken charges with hydrogens summed into heavy atoms:
elementType: O C C C C C C C C C C C C C
charge: -0.187341 0.118190 0.062482 -0.064068 0.003559 0.439169 -0.193425 -0.083054 -0.084797 0.036663 -0.165563 0.357726 -0.116379 -0.123162
polarizability: 1.90223343e+02 -5.24483516e+00 1.30617214e+02 -4.68095481e+00 5.60940797e+00 1.12078283e+02
1716.lowfreq: -16.0739 -2.9355 -1.3870 -0.0002 0.0001 0.0005 27.8155 41.9302 61.0405
frequency: 27.2544 41.6508 61.0311 77.0895 127.2387 129.3456 144.1278 169.7431 178.0598 188.3701 229.4599 232.6807 270.6436 309.2402 322.9801 324.8916 334.9885 394.7379 412.9593 433.8891 481.6996 499.6863 542.4810 578.8836 614.7847 699.7631 713.0006 805.7780 820.4234 844.2115 858.3589 886.6659 930.5299 944.1222 950.8380 974.5424 991.7796 1000.3450 1003.0770 1030.8991 1058.2579 1072.1420 1081.2884 1094.4651 1103.9351 1124.7401 1146.9690 1167.2227 1199.8511 1208.3838 1238.3891 1258.0518 1278.3705 1288.0513 1295.1646 1304.7318 1342.6976 1353.6194 1358.4958 1386.7557 1389.0432 1392.7403 1395.9445 1400.4953 1455.5454 1461.6111 1464.9895 1465.6725 1470.1153 1472.7296 1473.8504 1480.7384 1486.7562 1637.3526 1669.5841 1683.0393 2844.9910 2914.7342 2916.3934 2959.5404 2963.0980 2965.0401 2978.0428 2985.1670 2994.2853 3031.1572 3034.3065 3036.9453 3053.4556 3071.4123 3077.1890 3081.8505 3084.4878 3088.4352 3090.3423 3095.7174
redmass: 3.1849 3.7116 4.2351 2.9925 1.8875 1.2443 3.0347 3.3712 1.1537 1.0773 1.3226 3.3730 2.5156 1.7242 3.0780 2.9401 2.7068 2.7997 2.6841 2.6096 2.6998 3.1561 2.8358 2.7364 4.1155 3.3075 3.1361 2.4424 1.8781 1.3933 1.5590 1.9625 1.6301 1.7075 1.4977 1.8765 1.2536 1.5968 2.1662 1.4583 1.9297 1.6394 1.6749 1.9731 2.0203 2.8050 2.6681 1.7624 1.7767 2.1597 1.4264 1.3449 1.5757 1.3439 1.3896 1.4339 1.7378 1.7530 1.4496 1.2370 1.2753 1.2393 1.2199 1.2254 1.0495 1.0503 1.0552 1.0579 1.0768 1.0453 1.0888 1.0564 1.0554 8.6252 7.2141 6.4349 1.0839 1.0805 1.0808 1.0374 1.0376 1.0384 1.0358 1.0818 1.0617 1.0971 1.0964 1.0959 1.1003 1.0996 1.0987 1.0971 1.0987 1.0931 1.0933 1.0905
irintensity: 0.4287 1.0715 3.4899 0.3503 3.1437 1.1974 3.0309 3.9292 1.6742 0.0731 0.5273 1.8263 0.6271 0.2549 5.3410 0.8617 1.3154 4.1346 0.6070 2.3709 3.0231 2.1419 6.9180 3.1048 3.2629 6.3966 5.1676 2.0272 7.4004 7.8258 15.4974 2.6909 0.7245 2.1617 1.2048 0.4178 2.3654 18.3026 24.4814 3.2419 4.7819 17.6081 2.6372 0.1627 10.2481 13.9582 1.0393 3.6195 2.3028 2.7265 12.4299 4.1918 1.2028 1.8404 8.5028 1.7144 1.2690 1.8790 2.9006 16.3205 24.4348 0.6649 15.2101 13.0619 1.4546 17.2919 21.0493 12.4345 1.6893 24.7327 7.7497 15.1638 1.6086 144.1627 7.7607 6.3225 117.4936 8.4095 42.2258 35.3943 51.3695 47.4269 33.6647 34.2315 21.3956 1.3278 45.3349 23.8038 19.5013 51.1239 25.2349 10.5263 35.8799 22.0697 48.5063 33.3813
temp: 298.150 k
press: 1.00000 atm
elementType: 8 6 6 6 6 6 6 6 6 6 6 6 6 6 1 1 1 1 1 1 1 1 1 1 1 1 1 1 1 1 1 1 1 1
symmnumber: 1
zpe: 771654.9 jmol-1
zpe.correction: 0.293908 hartree
zpe.thermalcorrener: 0.310100 hartree
zpe.thermalcorrenthalpy: 0.311044 hartree
zpe.thermalcorrgfe: 0.249951 hartree
zpe.sumelectzpe: -581.473082 hartree
zpe.sumelectthermal: -581.456889 hartree
zpe.sumelectthermalent: -581.455945 hartree
zpe.sumelectthermalfe: -581.517038 hartree
dipole: -0.3196 -2.9070 -1.2370
dipole: 3.1754
quadrupole: -77.9182 -99.2628 -83.8709
quadrupole: -4.4893 -1.2844 -2.7433
quadrupole: 9.0991 -12.2455 3.1464 -4.4893 -1.2844 -2.7433
hfenergy: -581.7669896 hartree
pointgroup: C01 [X(C13H20O1)]
dipole: 0.069251 -1.1668551 0.4408572 debye
polarizability: 190.0811397|1.277023|130.5559414|-8.3527194|-4.6585503|112.281758 unknown
InChI: InChI=1S/C13H20O/c1-9(2)5-12-6-10(3)11(4)7-13(12)8-14/h5-6,8,11-13H,7H2,1-4H3
charge 0 multiplicity 1
34 atoms
O  -0.588841 3.239322 0.118896
C  0.320416 1.038164 0.771032
C  2.500082 0.08974 -0.153958
C  1.384964 1.148684 -0.333717
C  -0.406849 -0.347818 0.735144
C  1.924979 -1.289286 0.199521
C  0.62876 -1.458174 0.589383
C  3.406132 0.05602 -1.412829
C  -1.441227 -0.428036 -0.384419
C  -0.693386 2.173126 0.771329
C  2.875545 -2.473004 0.143057
C  -2.778005 -0.684768 -0.276799
C  -3.657496 -0.732942 -1.517116
C  -3.517874 -0.936473 1.025898
H  0.834147 1.096281 1.760499
H  3.141999 0.403892 0.701442
H  1.819145 2.165138 -0.339948
H  0.903945 1.012639 -1.321931
H  -0.921441 -0.488131 1.706888
H  0.266454 -2.471715 0.812805
H  3.767251 1.074528 -1.646661
H  4.289651 -0.590823 -1.271708
H  2.844674 -0.315004 -2.290785
H  -1.030298 -0.277991 -1.393867
H  -1.57599 2.00399 1.444628
H  3.784649 -2.283796 0.748374
H  3.21971 -2.675047 -0.889386
H  2.396476 -3.390932 0.525666
H  -3.078764 -0.549663 -2.438599
H  -4.156315 -1.718113 -1.612864
H  -4.463113 0.025973 -1.460796
H  -4.327074 -0.191625 1.161931
H  -4.006319 -1.930953 1.008034
H  -2.867889 -0.897801 1.915154
