program: Gaussian 09
title: 000170658
version: EM64L-G09RevD.01
frameworkgroup: C1[X(C13H20O)]
method: RPBEPBE
basis: SDD
operation: Freq
keyword: #pfreq=noraman
keyword: PBEPBE/SDD
title: #p freq=noraman PBEPBE/SDD
converged: YES YES NO NO
title: Mulliken charges:
elementType: O C C C C C C C C C C C C C H H H H H H H H H H H H H H H H H H H H
charge: -0.188894 -0.131374 -0.158486 -0.525833 -0.201756 0.448597 -0.421903 -0.733246 -0.325267 -0.125629 -0.837165 0.359273 -0.783296 -0.796062 0.241139 0.205569 0.230138 0.233482 0.201049 0.228435 0.222910 0.216945 0.216019 0.246007 0.166423 0.221234 0.228883 0.222203 0.231710 0.215773 0.219770 0.224204 0.224444 0.224706
chargesum: 0.00000
title: Mulliken charges with hydrogens summed into heavy atoms:
elementType: O C C C C C C C C C C C C C
charge: -0.188894 0.109765 0.047083 -0.062213 -0.000707 0.448597 -0.193468 -0.077371 -0.079261 0.040793 -0.164845 0.359273 -0.116043 -0.122708
polarizability: 1.91498867e+02 -3.08129080e+00 1.30451117e+02 -8.35198251e+00 4.29525919e+00 1.11126218e+02
1716.lowfreq: -19.4902 -11.2874 -9.4151 -0.0010 -0.0008 -0.0007 12.4768 45.0087 62.9061
frequency: -5.1233 44.9527 62.8700 73.4664 108.3633 119.1169 156.6924 169.7266 170.6688 180.7062 187.8553 229.5615 254.4578 266.4151 311.1255 334.6317 359.8146 384.9253 415.5194 445.4927 483.1858 530.6139 545.9835 584.0252 624.8330 710.8155 723.7044 808.8468 823.5333 837.9641 852.0581 874.6479 927.4828 944.2156 949.4732 961.7731 990.8640 1000.0116 1007.1970 1023.9634 1049.8831 1065.5809 1080.3167 1083.4169 1108.1056 1121.2186 1158.2900 1164.3342 1179.8240 1208.1747 1246.0585 1261.6252 1276.8251 1285.8976 1298.7497 1309.0507 1343.5838 1356.4459 1363.2013 1387.8264 1389.1138 1393.8151 1396.2246 1399.7609 1454.7325 1461.3222 1464.6450 1469.0327 1470.9965 1471.5946 1473.5555 1478.1609 1482.5804 1636.8056 1673.2480 1683.5292 2847.6521 2922.8916 2953.7300 2959.5783 2961.2049 2965.5190 2978.4802 2984.6605 3003.2243 3031.1085 3032.1435 3034.5926 3057.1926 3073.0056 3076.5258 3079.1638 3081.4727 3088.2618 3090.6677 3095.6695
redmass: 3.0376 4.3763 3.6555 2.9459 1.0908 2.1191 2.2682 1.3426 4.0698 1.1401 1.0826 3.7702 2.2119 2.7071 2.5611 3.3984 3.1931 2.1093 2.4472 2.7204 2.9320 2.7787 2.9957 3.4962 3.7271 3.6276 3.1302 2.3580 1.7153 1.5136 1.6187 2.0542 2.0370 1.6489 1.5234 1.7896 1.2511 1.7561 1.8665 1.5263 1.7405 1.5878 1.6488 1.6522 2.3916 2.5410 2.3612 2.1252 1.6354 1.6515 1.4841 1.8295 1.5029 1.3629 1.3461 1.3708 1.7616 1.4379 1.5882 1.2683 1.2859 1.2436 1.2091 1.2223 1.0495 1.0496 1.0497 1.0730 1.0707 1.0484 1.0827 1.0589 1.0535 8.5411 6.9442 6.4862 1.0840 1.0793 1.0797 1.0375 1.0395 1.0386 1.0356 1.0820 1.0624 1.0970 1.0964 1.0963 1.1012 1.0997 1.0987 1.0984 1.0967 1.0913 1.0952 1.0905
irintensity: 0.2881 2.0790 2.3690 0.4630 0.3068 2.2937 4.0183 1.1312 3.4598 2.0644 0.0320 3.5173 1.4155 0.5266 3.2035 0.9920 0.6938 1.0337 2.8431 1.7524 4.6956 4.3807 5.1592 1.8315 2.3653 13.0837 3.8918 2.9575 3.5745 9.2128 15.8943 3.9653 0.1642 1.8065 1.8619 1.0932 3.3475 14.5536 8.5892 11.6321 5.9701 17.2547 3.1410 12.5944 4.9368 15.1000 1.7855 1.4703 0.0531 2.5540 9.1786 13.0598 0.6651 0.5435 2.0965 4.3445 2.4143 3.7842 0.8006 11.0718 37.0450 1.8928 12.5984 11.0157 0.8720 12.0046 12.1913 9.9342 16.4266 21.7908 11.3438 6.1557 16.0162 147.5251 10.0123 4.1012 115.3872 18.8148 19.1501 39.4382 62.0158 48.0726 35.5953 33.6180 24.3071 3.0485 26.0848 43.7794 25.2527 39.4160 48.0864 25.5381 8.7222 26.6096 46.9214 30.0917
temp: 298.150 k
press: 1.00000 atm
elementType: 8 6 6 6 6 6 6 6 6 6 6 6 6 6 1 1 1 1 1 1 1 1 1 1 1 1 1 1 1 1 1 1 1 1
symmnumber: 1
zpe: 771267.3 jmol-1
zpe.correction: 0.293760 hartree
zpe.thermalcorrener: 0.309208 hartree
zpe.thermalcorrenthalpy: 0.310152 hartree
zpe.thermalcorrgfe: 0.251517 hartree
zpe.sumelectzpe: -581.473160 hartree
zpe.sumelectthermal: -581.457712 hartree
zpe.sumelectthermalent: -581.456768 hartree
zpe.sumelectthermalfe: -581.515402 hartree
dipole: -0.2961 -2.8824 -1.3157
dipole: 3.1824
quadrupole: -78.0060 -98.9597 -84.2310
quadrupole: -3.4884 -2.7816 -3.8315
quadrupole: 9.0596 -11.8942 2.8346 -3.4884 -2.7816 -3.8315
hfenergy: -581.7669199 hartree
pointgroup: C01 [X(C13H20O1)]
dipole: 0.0296989 -1.18433 0.4050523 debye
polarizability: 191.023974|-1.3977693|130.8782417|-11.0835093|-1.6156931|111.1739868 unknown
InChI: InChI=1S/C13H20O/c1-9(2)5-12-6-10(3)11(4)7-13(12)8-14/h5-6,8,11-13H,7H2,1-4H3
charge 0 multiplicity 1
34 atoms
O  -0.396955 3.216955 0.011552
C  0.450496 0.964736 0.564601
C  2.455324 -0.102327 -0.592704
C  1.39149 1.024293 -0.653586
C  -0.355396 -0.376835 0.609299
C  1.821029 -1.451313 -0.236786
C  0.571107 -1.548739 0.299782
C  3.621972 0.258487 0.371595
C  -1.532835 -0.370314 -0.362643
C  -0.490306 2.155915 0.674221
C  2.64994 -2.690393 -0.525386
C  -2.859289 -0.524088 -0.077551
C  -3.896372 -0.493892 -1.189935
C  -3.438022 -0.726531 1.312444
H  1.068041 0.992874 1.492994
H  2.900225 -0.204175 -1.606169
H  1.878081 2.015455 -0.704162
H  0.790495 0.924152 -1.577145
H  -0.743658 -0.509125 1.638995
H  0.150499 -2.544134 0.502063
H  4.113324 1.194054 0.046863
H  3.257764 0.40218 1.405577
H  4.389998 -0.535193 0.396414
H  -1.249395 -0.242916 -1.418033
H  -1.300226 2.036585 1.442533
H  2.92181 -2.744026 -1.598575
H  2.105822 -3.614698 -0.264525
H  3.601244 -2.687828 0.041783
H  -3.432424 -0.34803 -2.18045
H  -4.478441 -1.436821 -1.216791
H  -4.62656 0.324163 -1.029086
H  -4.153185 0.084418 1.555888
H  -4.010567 -1.674036 1.359367
H  -2.675133 -0.755753 2.107359
