program: Gaussian 09
title: 000170672
version: EM64L-G09RevD.01
frameworkgroup: C1[X(C18H23NO)]
method: RPBEPBE
basis: SDD
operation: Freq
keyword: #p
keyword: freq=noraman
keyword: PBEPBE/SDD
title: #p freq=noraman PBEPBE/SDD
converged: YES YES NO NO
title: Mulliken charges:
elementType: O N C C C C C C C C C C C C C C C C C C H H H H H H H H H H H H H H H H H H H H H H H
charge: -0.469833 -0.294148 0.137482 -0.041294 -0.674056 -0.423154 0.432102 -0.760368 0.473857 -0.394757 -0.416725 -0.386596 -0.456611 -0.259424 -0.228597 -0.627341 -0.242860 -0.230399 -0.230020 -0.239812 0.179893 0.218120 0.218178 0.240774 0.189134 0.225613 0.248812 0.231408 0.351942 0.225038 0.259192 0.243883 0.249588 0.258771 0.223815 0.223675 0.187037 0.229357 0.219095 0.226610 0.226296 0.227080 0.229246
chargesum: 0.00000
title: Mulliken charges with hydrogens summed into heavy atoms:
elementType: O N C C C C C C C C C C C C C C C C C C
charge: -0.117891 -0.050265 0.137482 0.138598 -0.237758 0.006754 0.432102 -0.054535 0.473857 -0.169720 -0.157533 -0.137008 -0.197840 -0.035608 -0.004922 0.008148 -0.016250 -0.004103 -0.002941 -0.010567
polarizability: 2.23986545e+02 1.51076634e+01 2.10025075e+02 8.00553917e+00 -1.87622376e+01 1.57430299e+02
1716.lowfreq: -12.3413 -4.6478 -0.0006 -0.0001 0.0004 5.7710 24.6767 34.2808 44.7964
frequency: 22.5196 34.1146 44.7820 52.5568 61.4392 70.6507 93.8108 98.8593 167.7343 187.4943 197.3150 227.1713 239.9866 252.2912 261.9760 282.3186 294.5625 306.0628 361.2291 380.3303 390.2640 405.1355 416.2778 423.0648 459.6552 483.3199 524.6700 565.8424 591.0656 616.6645 617.8729 641.8359 669.4538 705.5865 707.9314 711.6691 760.7209 775.8229 803.2349 848.7986 855.6897 858.4215 883.0649 914.6695 920.4145 926.7451 954.8807 968.5661 977.3472 979.3356 981.7288 988.7626 989.5152 992.7833 996.7070 1001.7404 1027.5551 1029.5779 1054.8959 1080.2456 1081.4062 1094.0093 1117.8472 1136.2454 1155.8107 1162.5450 1171.8179 1172.6717 1176.4104 1189.1781 1189.7631 1213.0101 1234.7451 1246.5642 1266.9425 1301.4624 1307.9374 1312.0944 1320.1662 1329.8760 1361.9535 1378.2377 1380.8320 1383.4182 1432.4485 1435.2495 1439.3806 1445.5672 1464.4621 1465.5573 1473.3952 1479.3499 1481.7336 1482.2968 1487.6323 1495.2806 1589.0528 1589.7137 1610.3221 1611.5106 2864.2075 2874.8680 2941.7883 2988.7438 3012.4217 3015.1327 3039.3729 3071.3012 3073.0338 3088.3752 3093.4815 3110.0713 3118.4397 3124.4731 3125.5382 3136.5442 3137.5913 3147.7293 3151.5850 3163.6385 3163.7526 3434.8910 3496.2508
redmass: 4.1672 4.1567 3.4880 3.5028 3.4082 2.8827 2.6298 3.2684 2.9858 2.9244 3.7693 2.0974 2.1463 2.1020 1.5349 5.0125 4.4259 2.6251 2.5749 1.4862 2.0845 2.8186 2.0041 2.6991 3.3241 3.1853 3.0559 4.5752 4.1231 6.3694 6.2198 2.6845 1.4932 2.2345 1.7131 2.4859 1.8945 2.0776 3.9666 2.7386 1.2532 1.2651 2.3186 1.3681 1.4460 1.4180 2.1655 1.9607 1.5950 1.4069 2.1228 5.3485 4.6767 2.0847 1.3446 1.6612 2.1997 2.0920 1.6666 1.5845 1.6059 1.6651 1.8171 2.0578 2.3823 2.0283 1.0627 1.0792 1.7730 1.1194 1.1566 2.4488 1.9553 1.3281 1.4685 1.3031 1.4359 1.3635 1.5459 1.2743 1.4075 3.2639 2.2964 2.7561 2.2228 1.1653 2.0993 1.2082 1.0715 1.1028 1.0858 2.0613 1.2637 1.7099 1.0555 1.0514 5.9390 6.1432 6.1439 6.0835 1.0595 1.0679 1.0818 1.0349 1.0737 1.0590 1.0878 1.1016 1.0999 1.0998 1.1003 1.0864 1.0862 1.0863 1.0867 1.0925 1.0918 1.0962 1.0945 1.1011 1.1007 1.0744 1.0653
irintensity: 0.0989 0.1208 0.4668 0.4336 0.3085 0.9023 1.3720 0.7126 1.8033 1.7427 0.7790 0.3749 1.5996 2.1341 0.5394 2.1005 5.4884 2.3004 2.5614 60.2865 38.9090 0.2375 52.1105 26.0685 3.4105 2.8479 8.8035 13.6998 12.3122 0.1539 0.0952 61.1524 70.8477 21.0681 52.1012 43.9069 19.3813 37.9300 1.2910 3.0913 0.0209 0.6143 6.3394 10.9618 0.4951 1.9296 11.2544 39.2748 2.4430 0.3915 12.2738 0.4880 0.2835 1.5667 0.4866 0.1240 8.0499 5.8742 19.7638 23.7454 1.7075 14.1109 28.5663 14.0761 53.6043 5.3232 0.2938 0.4472 5.9340 1.1896 0.2315 0.4085 15.1210 7.9691 15.7471 2.8354 1.7427 11.1890 32.0734 5.2529 5.8881 6.5948 11.3187 9.2435 8.3246 0.4821 12.1390 13.7868 20.4269 7.0728 7.4310 17.4763 15.2994 15.5029 6.3977 11.3181 0.9931 1.0202 6.0542 5.9303 114.7752 189.8729 23.7885 22.2348 54.3172 22.4931 18.8650 17.7859 40.5034 21.6799 24.0740 10.9261 4.8066 0.6168 0.0693 26.5551 15.9958 34.5211 23.8745 19.1398 25.7709 2.0208 28.0118
temp: 298.150 k
press: 1.00000 atm
elementType: 8 7 6 6 6 6 6 6 6 6 6 6 6 6 6 6 6 6 6 6 1 1 1 1 1 1 1 1 1 1 1 1 1 1 1 1 1 1 1 1 1 1 1
symmnumber: 1
zpe: 958088.4 jmol-1
zpe.correction: 0.364917 hartree
zpe.thermalcorrener: 0.384729 hartree
zpe.thermalcorrenthalpy: 0.385673 hartree
zpe.thermalcorrgfe: 0.315374 hartree
zpe.sumelectzpe: -828.182752 hartree
zpe.sumelectthermal: -828.162939 hartree
zpe.sumelectthermalent: -828.161995 hartree
zpe.sumelectthermalfe: -828.232294 hartree
dipole: 1.3781 -0.8947 -1.5322
dipole: 2.2467
quadrupole: -116.5872 -115.1743 -116.6764
quadrupole: 6.6092 6.8530 -4.5368
quadrupole: -0.4412 0.9717 -0.5304 6.6092 6.8530 -4.5368
hfenergy: -828.5476687 hartree
pointgroup: C01 [X(C18H23N1O1)]
dipole: 0.5702609 0.3251653 0.5919244 debye
polarizability: 221.782302|-16.2199147|211.4796637|-9.6614549|-18.8243588|158.1799529 unknown
InChI: InChI=1S/C18H23NO/c1-15(14-19-2)18(20,17-11-7-4-8-12-17)13-16-9-5-3-6-10-16/h3-12,15,19-20H,13-14H2,1-2H3
charge 0 multiplicity 1
43 atoms
O  -0.697815 0.61166 -1.436684
N  -4.447166 1.041463 0.552375
C  -0.766745 0.024246 -0.084222
C  -2.298238 -0.163903 0.198687
C  -0.106537 1.01717 0.950296
C  -3.113783 1.12705 -0.082651
C  -0.03253 -1.335075 -0.039974
C  -2.909364 -1.337073 -0.602745
C  1.282087 1.485117 0.538987
C  0.067287 -2.063946 1.175023
C  0.532383 -1.896468 -1.20913
C  2.448001 0.763288 0.909136
C  1.435333 2.65351 -0.257079
C  0.727205 -3.310861 1.221525
C  1.199924 -3.142335 -1.166124
C  -5.366242 2.137969 0.19716
C  1.304091 -3.854625 0.049399
C  3.727848 1.195827 0.497756
C  2.716184 3.087925 -0.671516
C  3.867218 2.358764 -0.296033
H  -2.386094 -0.394862 1.284088
H  -0.0660 0.516593 1.933856
H  -0.770847 1.893455 1.051538
H  -3.254621 1.222266 -1.174548
H  -2.550721 2.038177 0.236308
H  -2.524458 -2.315851 -0.269274
H  -4.005304 -1.320082 -0.47305
H  -2.677536 -1.223718 -1.676979
H  0.225737 0.94941 -1.583353
H  -0.381008 -1.666319 2.094363
H  0.426988 -1.360448 -2.157555
H  -4.370274 0.918216 1.571495
H  2.348189 -0.143716 1.516122
H  0.546998 3.237065 -0.528545
H  0.789875 -3.858695 2.168937
H  1.632494 -3.557824 -2.083615
H  -4.974681 3.162067 0.419553
H  -5.584137 2.097322 -0.886238
H  -6.32312 2.012576 0.734927
H  1.819514 -4.82104 0.083873
H  4.615856 0.626811 0.795527
H  2.814595 3.994204 -1.279942
H  4.860916 2.694588 -0.613072
