program: Gaussian 09
title: 000170735
version: EM64L-G09RevD.01
frameworkgroup: C1[X(C28H22N2O6S2)]
method: RPBEPBE
basis: SDD
operation: Freq
keyword: #p
keyword: freq=noraman
keyword: PBEPBE/SDD
title: #p freq=noraman PBEPBE/SDD
converged: YES YES NO NO
title: Mulliken charges:
elementType: S S O O O O O O N N C C C C C C C C C C C C C C C C C C C C C C C C C C C C H H H H H H H H H H H H H H H H H H H H H H
charge: 0.889536 0.889537 -0.288138 -0.288082 -0.550012 -0.555128 -0.550010 -0.555131 -0.050497 -0.050536 0.243530 0.243608 0.194191 0.194171 0.073803 0.073801 -0.422740 -0.422705 -0.073824 -0.073811 0.057264 0.057254 0.265673 0.265658 -0.376109 -0.376111 -0.389941 -0.390017 -0.503535 -0.503536 -0.229164 -0.229176 -0.353114 -0.353108 -0.257856 -0.257780 -0.634725 -0.634727 0.288925 0.288954 0.312811 0.312804 0.296252 0.296218 0.259736 0.261440 0.259732 0.261445 0.294977 0.294985 0.267310 0.267312 0.234024 0.234020 0.231199 0.257794 0.256280 0.231198 0.257790 0.256284
chargesum: 0.00000
title: Mulliken charges with hydrogens summed into heavy atoms:
elementType: S S O O O O O O N N C C C C C C C C C C C C C C C C C C C C C C C C C C C C
charge: 0.889536 0.889537 -0.288138 -0.288082 -0.550012 -0.555128 -0.550010 -0.555131 -0.050497 -0.050536 0.243530 0.243608 0.194191 0.194171 0.073803 0.073801 -0.133815 -0.133752 -0.073824 -0.073811 0.057264 0.057254 0.265673 0.265658 -0.063298 -0.063307 -0.093688 -0.093799 0.017640 0.017641 0.065813 0.065809 -0.085805 -0.085797 -0.023831 -0.023760 0.110548 0.110545
polarizability: 9.53777970e+02 1.50148993e-03 4.22945599e+02 3.76361123e+00 -3.39104756e-02 1.99847790e+02
1716.lowfreq: -2.1085 -1.3017 -0.0009 0.0014 0.0015 2.0685 12.6535 12.9429 17.6382
frequency: 12.1907 12.8984 17.5528 23.7349 30.0500 30.3737 39.1596 41.3044 48.3389 59.6271 69.0179 73.2781 103.5727 107.7960 113.9986 128.8847 134.0738 163.3548 163.9124 185.9912 192.3512 192.4047 199.9005 228.9291 231.5697 231.6887 238.5187 249.4234 252.7871 259.4989 269.3779 280.0121 313.3697 326.1215 329.3035 346.1352 348.7652 355.5254 369.8672 391.8841 417.9577 440.1156 440.4014 442.8981 460.6574 470.9441 479.4712 487.6859 509.4180 527.3621 528.7087 548.0260 580.1591 580.2841 593.4672 607.9544 614.7188 617.6900 642.8949 661.2051 665.0829 665.6553 700.7450 706.9718 753.8420 754.6014 769.6902 780.7776 780.8055 784.4109 787.1960 789.7710 790.6551 791.3796 823.2001 828.4837 828.5646 840.4528 847.6538 865.4574 885.8751 892.4180 899.9462 905.5464 909.5589 909.6293 913.8852 913.9774 951.9275 959.6898 959.7093 974.4301 974.5099 989.5840 1009.7397 1017.0460 1028.8274 1029.8123 1032.9217 1044.1879 1044.3382 1066.7866 1066.9316 1073.3850 1074.9392 1113.5743 1115.7914 1165.6345 1167.2450 1172.2627 1190.0524 1195.7860 1205.1134 1213.4331 1237.0057 1237.0130 1247.3646 1247.6727 1250.1679 1250.1890 1258.8186 1274.4006 1307.5042 1349.9886 1368.7277 1383.3029 1395.0435 1395.0635 1398.8763 1399.9528 1410.4604 1410.4629 1418.5525 1419.8395 1435.7111 1436.4715 1447.3705 1455.0259 1463.1237 1463.1287 1482.7072 1482.7112 1496.1678 1515.6754 1535.2778 1554.7914 1587.8544 1594.0146 1595.0892 1611.8132 1611.8209 1624.5835 2993.9818 2993.9908 3044.4575 3044.4616 3088.7070 3088.7112 3103.9016 3103.9055 3136.4617 3139.3390 3139.3432 3154.1335 3154.1635 3157.5050 3164.0556 3169.9946 3170.0234 3180.8565 3184.2408 3184.2537 3213.3397 3216.1479
redmass: 5.9762 5.4455 5.7799 4.3326 6.9549 3.5569 3.7315 3.2027 3.8909 4.8491 4.7277 7.1189 5.5692 6.1673 6.4504 9.4222 7.1607 5.9086 6.4112 8.6144 1.5272 1.5159 4.4915 5.6526 4.8656 5.0084 5.5465 5.8049 4.9650 2.1891 2.7870 6.4190 7.3242 8.2416 6.2783 6.8071 6.7423 6.5460 6.2375 5.4704 3.2073 3.4202 3.2481 4.9276 6.4876 5.8194 3.5141 6.2307 7.1643 7.8107 7.9374 8.0088 7.1207 4.8845 6.3730 4.6895 5.2412 6.6805 4.4790 6.5201 8.4791 8.2875 4.2542 7.4582 4.8134 4.9115 6.2306 1.2096 1.2090 5.8555 1.4427 7.9920 13.0478 7.6668 2.7296 1.4114 1.4004 9.0689 11.3542 9.1011 7.1687 1.4144 7.2576 1.7906 2.0349 2.0055 2.4861 2.5443 7.5928 1.3445 1.3448 1.5497 1.5460 1.3660 1.3332 1.4128 2.4692 1.9796 2.7871 1.4527 1.4595 2.6653 2.6371 2.5302 5.3941 1.8178 1.7257 1.7332 2.4349 2.5595 1.2505 2.4640 3.8835 1.6814 1.2483 1.2482 1.3449 1.3520 1.2617 1.2617 2.1434 5.3677 2.0973 5.6661 2.1063 8.4165 1.1639 1.1638 3.6854 3.0162 1.1315 1.1313 4.9377 4.8245 3.6754 3.0788 2.8773 2.4998 1.0345 1.0346 1.0511 1.0511 7.0582 7.7220 4.4593 5.8536 7.1748 8.1001 8.3264 8.6490 8.6158 5.8320 1.0361 1.0361 1.0568 1.0568 1.0976 1.0976 1.1020 1.1020 1.0876 1.1099 1.1099 1.0900 1.0901 1.0955 1.0890 1.0936 1.0936 1.0964 1.0966 1.0966 1.0921 1.0936
irintensity: 1.0116 3.5727 1.1863 0.1341 1.4415 1.7186 0.6977 2.9838 1.9684 2.2063 1.0469 1.2552 0.0972 0.3601 0.2267 1.6327 1.5301 14.5300 1.6759 2.9972 0.1813 0.0257 6.2734 19.1366 0.1694 49.7748 0.3672 0.6476 1.0060 0.4420 1.6495 5.9083 1.7845 20.2460 4.8603 0.2556 0.9754 2.2218 11.5204 0.0079 0.0256 18.9104 0.0766 4.7557 30.7889 162.4143 0.0647 5.3057 10.1028 15.7737 120.6668 1.3046 8.5764 1.4119 12.0346 4.1727 39.1013 34.6600 0.1431 1.2602 21.1313 2.1118 1.0261 0.0574 0.1991 0.2480 0.6496 1.7693 2.5590 28.2711 65.4585 213.4969 8.6297 57.7907 0.0317 1.2678 81.1101 10.9336 22.5051 0.2398 3.7088 28.9433 17.0835 0.0634 34.3995 42.5351 33.1225 49.7996 148.3545 0.4152 0.8695 55.5782 12.6530 3.1075 0.0082 0.0040 0.0191 93.3480 23.1009 1.5301 17.5210 45.0491 7.2564 0.1265 75.9176 25.2388 5.5964 2.2875 1.3695 9.3149 2.7978 1.1106 74.8894 0.0733 0.9233 0.7493 36.9515 5.2826 12.6817 13.0379 0.9457 54.0036 0.3105 5.5778 114.0707 35.1967 51.7968 22.7669 5.6107 101.6534 4.4754 0.3834 0.1757 39.2572 17.0532 11.7464 25.0717 4.2522 17.1894 22.9056 8.2759 18.5719 7.7583 392.8892 37.7199 6.1102 0.0403 1.4691 5.0099 0.0954 0.0063 3.0256 30.7883 9.1871 14.3453 9.0991 7.2256 9.8581 3.1691 3.4278 12.4538 5.4832 7.0379 29.6905 0.4724 23.8656 0.1389 10.0325 13.3750 0.1402 1.2692 2.9546 6.3680 16.2175
temp: 298.150 k
press: 1.00000 atm
elementType: 16 16 8 8 8 8 8 8 7 7 6 6 6 6 6 6 6 6 6 6 6 6 6 6 6 6 6 6 6 6 6 6 6 6 6 6 6 6 1 1 1 1 1 1 1 1 1 1 1 1 1 1 1 1 1 1 1 1 1 1
symmnumber: 1
zpe: 1144360.7 jmol-1
zpe.correction: 0.435864 hartree
zpe.thermalcorrener: 0.470715 hartree
zpe.thermalcorrenthalpy: 0.471659 hartree
zpe.thermalcorrgfe: 0.363653 hartree
zpe.sumelectzpe: -2434.177672 hartree
zpe.sumelectthermal: -2434.142821 hartree
zpe.sumelectthermalent: -2434.141877 hartree
zpe.sumelectthermalfe: -2434.249883 hartree
dipole: 0.0020 5.6280 -0.0028
dipole: 5.6280
quadrupole: -281.1987 -224.5624 -242.8384
quadrupole: 0.0705 90.9545 0.0052
quadrupole: -31.6655 24.9708 6.6947 0.0705 90.9545 0.0052
hfenergy: -2434.613536 hartree
pointgroup: C01 [X(C28H22N2O6S2)]
dipole: 0.0008103 2.2142357 0.0012418 debye
polarizability: 951.9899025|0.019081|422.9454144|-36.8652339|0.2050364|201.6360418 unknown
InChI: InChI=1S/C28H22N2O6S2/c1-3-37(31,32)17-9-13-25-23(15-17)29-27(35-25)21-11-12-22(20-8-6-5-7-19(20)21)28-30-24-16-18(38(33,34)4-2)10-14-26(24)36-28/h5-16H,3-4H2,1-2H3
charge 0 multiplicity 1
60 atoms
S  -8.801823 -1.257804 0.838242
S  8.801389 -1.25733 -0.841298
O  -3.787386 1.993883 0.280186
O  3.787407 1.99434 -0.278973
O  -8.32907 -2.673616 1.512952
O  -9.95607 -0.309567 1.512863
O  8.328248 -2.672793 -1.516464
O  9.955326 -0.308799 -1.516038
N  -3.518174 -0.306757 0.332656
N  3.518075 -0.306242 -0.332179
C  -0.728674 2.317101 0.065214
C  0.728667 2.317306 -0.059531
C  -1.433879 1.04966 0.123032
C  1.433907 1.050012 -0.120691
C  -2.882229 0.864064 0.246664
C  2.882223 0.864553 -0.245099
C  -0.699712 -0.156085 0.059859
C  0.699759 -0.155903 -0.060411
C  -7.250104 -0.186705 0.618029
C  7.249835 -0.18626 -0.619744
C  -4.889514 -0.003187 0.428738
C  4.88937 -0.002702 -0.428955
C  -5.06357 1.412989 0.396514
C  5.063506 1.413448 -0.396303
C  -6.014364 -0.846912 0.550561
C  6.014105 -0.846435 -0.55178
C  -1.407296 3.581769 0.127744
C  1.407154 3.582227 -0.118465
C  -9.395734 -1.666318 -0.974904
C  9.396189 -1.666764 0.971345
C  -7.431188 1.216104 0.605599
C  7.430989 1.216536 -0.606898
C  -6.301636 2.060274 0.488748
C  6.301543 2.060714 -0.489065
C  -0.7095 4.788281 0.069354
C  0.70925 4.788508 -0.056571
C  -10.639081 -2.543977 -0.876339
C  10.639587 -2.544234 0.87172
H  -1.247719 -1.100691 0.106993
H  1.247801 -1.100369 -0.109893
H  -5.93405 -1.935365 0.624297
H  5.933675 -1.934851 -0.625921
H  -2.492019 3.595894 0.221979
H  2.491855 3.596751 -0.212759
H  -9.573539 -0.675061 -1.421762
H  -8.524868 -2.163776 -1.430997
H  9.574093 -0.675736 1.418671
H  8.525583 -2.164567 1.427559
H  -8.438577 1.628917 0.724005
H  8.438327 1.629342 -0.725771
H  -6.395519 3.148599 0.481908
H  6.395477 3.149032 -0.48192
H  -1.255858 5.736204 0.120129
H  1.25554 5.736616 -0.104564
H  -10.993517 -2.791636 -1.893883
H  -10.417396 -3.487193 -0.348349
H  -11.452528 -2.02166 -0.344263
H  10.994565 -2.792356 1.888962
H  10.417745 -3.487214 0.343375
H  11.452704 -2.021558 0.339492
