program: Gaussian 09
title: 000170781
version: EM64L-G09RevD.01
frameworkgroup: C1[X(C19H23ClN3O9P)]
method: RPBEPBE
basis: SDD
operation: Freq
keyword: #p
keyword: freq=noraman
keyword: PBEPBE/SDD
title: #p freq=noraman PBEPBE/SDD
converged: YES YES NO NO
title: Mulliken charges:
elementType: Cl P O O O O O O O O O N N N C C C C C C C C C C C C C C C C C C C H H H H H H H H H H H H H H H H H H H H H H H
charge: -0.059575 1.372674 -0.396759 -0.241966 -0.240223 -0.492385 -0.247732 -0.671154 -0.694163 -0.586050 -0.228125 -0.215109 -0.403134 -0.154361 -0.175588 -0.169758 0.062893 0.019665 -0.222736 -0.387876 0.566840 0.240795 -0.065598 -0.482676 -0.365310 -0.296038 -0.363634 -0.347681 0.157003 0.435038 -0.391437 -0.661843 -0.577085 0.264369 0.291431 0.267310 0.299004 0.216250 0.238653 0.252595 0.265646 0.229279 0.244986 0.367178 0.263072 0.243026 0.232129 0.250510 0.247995 0.398493 0.440149 0.231824 0.241797 0.239162 0.268967 0.289264
chargesum: 0.00000
title: Mulliken charges with hydrogens summed into heavy atoms:
elementType: Cl P O O O O O O O O O N N N C C C C C C C C C C C C C C C C C C C
charge: -0.059575 1.372674 -0.396759 -0.241966 -0.240223 -0.492385 -0.247732 -0.272661 -0.254014 -0.586050 -0.228125 -0.215109 -0.035956 -0.154361 0.088781 0.121673 0.330203 0.318669 -0.006485 0.103371 0.566840 0.240795 0.200048 -0.253397 -0.120323 -0.032965 -0.120608 -0.115552 0.157003 0.435038 0.107068 0.050939 -0.018855
polarizability: 4.17838036e+02 1.69790560e+01 2.50321507e+02 -1.31303050e+01 -7.26668688e+00 2.57176873e+02
1716.lowfreq: -9.2312 -0.0017 -0.0015 -0.0009 0.2127 2.3704 5.6427 7.8123 17.2579
frequency: -8.9229 7.5048 17.1974 18.1753 24.2215 33.2584 36.1956 41.4093 48.4528 55.5712 66.8626 100.4988 108.4349 111.7048 124.9082 144.5946 151.3868 170.4240 176.3968 183.9641 189.3615 199.2020 200.5410 216.2370 227.1753 246.5462 257.0310 272.2726 288.5141 315.7572 326.8699 342.6128 350.0539 350.7984 369.6128 378.9344 386.0133 401.3170 422.0039 427.0219 436.2137 442.4333 492.9354 512.0461 517.7880 527.2984 540.4627 568.4599 573.7613 600.5818 610.3956 626.8488 636.8523 664.1910 677.6391 684.4114 691.4908 699.4907 703.8583 719.9289 736.1897 742.8255 751.6395 773.7977 781.9401 786.1808 794.6183 808.2225 809.3981 828.4619 840.2671 852.4291 873.4187 892.6898 921.4198 927.9686 937.1821 944.3558 946.1434 948.2741 956.1503 956.5640 990.4691 997.6534 1002.1231 1011.6231 1012.6468 1023.9878 1037.8110 1042.4226 1058.7057 1073.5460 1090.7645 1096.3788 1110.4085 1118.4487 1136.9771 1180.9457 1196.9784 1199.9725 1205.6476 1215.2995 1228.8727 1239.2851 1241.3582 1243.9636 1249.9650 1255.3688 1259.0116 1263.8228 1268.3776 1279.3171 1284.5327 1305.4684 1315.0065 1317.6349 1326.0088 1337.3478 1348.9267 1359.9276 1365.7084 1371.7477 1377.6053 1386.2020 1407.0223 1426.6169 1438.9165 1449.4885 1450.2186 1458.9798 1473.5591 1492.4355 1507.6556 1532.6573 1574.1066 1609.6710 1633.5332 1655.3449 1676.3401 2949.3303 2953.4455 2994.2040 3014.0749 3020.9253 3022.6730 3028.1481 3034.4351 3061.9714 3062.7403 3076.4180 3077.0583 3078.0579 3100.8935 3120.5281 3144.4048 3147.5539 3165.9325 3173.2897 3173.6083 3218.2382 3520.4137 3596.7836
redmass: 10.0552 7.1960 9.8337 7.3810 11.1242 6.2382 7.5011 6.8052 5.4175 4.9067 8.0130 5.3429 4.6371 3.7043 3.2560 5.8499 5.5174 7.9058 3.2630 4.7025 4.2706 3.7011 2.1976 4.1044 4.0010 2.8897 6.6658 3.3567 3.8220 2.6034 5.5475 4.4886 7.6418 5.3530 6.1461 10.4802 4.5600 4.1869 3.2459 4.8477 3.5892 4.6143 3.4507 5.8994 4.6767 2.8433 5.0269 4.6215 5.6423 5.8876 7.2348 7.0631 6.4157 10.1334 6.2839 3.3112 1.2608 2.3943 6.2369 3.9496 6.2693 4.5888 6.4117 1.7562 5.0830 1.1363 3.2989 1.2601 1.9696 2.4571 3.9513 3.8186 3.7574 3.0930 6.9330 5.4082 3.3064 1.5465 1.3623 2.5544 1.4863 4.8354 8.2260 5.1579 2.7980 1.4863 1.4604 3.8491 4.2554 2.6633 4.5468 2.4033 1.4622 4.1938 1.2951 2.7124 1.4523 1.6104 1.8518 1.2826 1.9492 1.8848 1.1208 2.3305 1.2739 1.6419 1.3031 1.1689 1.5354 1.2255 1.1700 1.2124 1.3083 1.4510 1.5271 1.4972 2.1588 1.2815 1.3753 2.3844 1.4622 1.4874 2.3418 1.7037 2.4613 2.1669 2.6000 1.0783 1.2792 1.1018 1.0451 1.0854 1.1156 2.9407 6.3623 5.8538 6.3081 11.1165 6.0329 1.0853 1.0378 1.0633 1.0820 1.0604 1.1010 1.0727 1.0855 1.0875 1.0567 1.0889 1.1038 1.1033 1.0964 1.0901 1.0879 1.1110 1.0958 1.0934 1.0912 1.0979 1.0770 1.0661
irintensity: 2.8335 0.6033 1.7463 0.1481 0.1969 1.0118 0.6255 2.0768 0.4431 0.1407 1.6133 2.4255 0.8114 2.3236 0.8563 1.3952 8.5506 6.2909 4.9514 1.4733 4.1169 7.6187 0.8736 7.7701 13.2259 28.0181 7.7070 34.8073 21.8076 74.7446 10.6307 12.0981 36.7150 4.1109 16.3540 15.1756 11.0802 1.0322 0.2647 4.9265 23.5721 14.3724 13.7446 5.3484 8.8152 4.8620 58.6308 11.3833 14.1838 5.1881 26.7455 3.0247 19.5196 19.2582 95.6260 4.1343 188.3081 23.6210 179.3532 36.9141 20.6024 2.7747 4.0913 39.4397 200.3298 8.7505 74.4701 0.1897 114.0805 46.1938 13.5225 39.1235 3.2911 126.7649 205.7172 100.3394 9.8344 22.6516 1.7237 40.7550 9.3209 231.4932 326.2697 5.2707 34.2219 9.8409 5.1299 28.1933 0.3927 63.7868 9.9132 9.9571 26.3146 201.6482 0.9232 3.3187 2.4595 61.4484 25.9784 93.6539 26.3279 48.9600 3.0716 32.8883 3.9443 24.6528 9.8497 15.1408 72.1566 28.3939 7.0352 206.3643 29.4013 59.3785 81.1770 53.0508 83.3811 1.1140 48.9963 39.5689 9.5426 20.4729 158.3340 25.6477 106.6467 93.5797 2.3271 10.1495 4.0626 11.5029 11.1106 22.2563 23.6552 147.8759 9.4126 26.2704 383.7865 230.3127 792.1910 40.0612 85.2832 14.4576 196.7475 35.1055 28.8458 1264.6192 43.4170 7.4370 17.9485 34.9586 6.2681 9.7314 22.2185 13.3773 18.0697 9.8610 16.3884 10.3259 2.6579 1.5898 69.5525 76.6807
temp: 298.150 k
press: 1.00000 atm
elementType: 17 15 8 8 8 8 8 8 8 8 8 7 7 7 6 6 6 6 6 6 6 6 6 6 6 6 6 6 6 6 6 6 6 1 1 1 1 1 1 1 1 1 1 1 1 1 1 1 1 1 1 1 1 1 1 1
symmnumber: 1
zpe: 1097431.4 jmol-1
zpe.correction: 0.417990 hartree
zpe.thermalcorrener: 0.449496 hartree
zpe.thermalcorrenthalpy: 0.450440 hartree
zpe.thermalcorrgfe: 0.349884 hartree
zpe.sumelectzpe: -2377.894450 hartree
zpe.sumelectthermal: -2377.862943 hartree
zpe.sumelectthermalent: -2377.861999 hartree
zpe.sumelectthermalfe: -2377.962556 hartree
dipole: -8.7908 -1.5381 -1.6129
dipole: 9.0689
quadrupole: -240.0669 -232.6019 -204.4154
quadrupole: -5.3365 -43.9090 12.2772
quadrupole: -14.3721 -6.9072 21.2793 -5.3365 -43.9090 12.2772
hfenergy: -2378.3124391 hartree
pointgroup: C01 [X(C19H23Cl1N3O9P1)]
dipole: 3.4160317 -0.5413191 0.8764826 debye
polarizability: 418.716725|-18.0521052|251.5138436|-2.5166824|6.7117121|255.1058485 unknown
InChI: InChI=1S/C19H23ClN3O9P/c1-22(9-7-20)12-4-2-11(3-5-12)18-31-15-13(10-29-33(26,27)28)30-17(16(15)32-18)23-8-6-14(24)21-19(23)25/h2-6,8,13,15-18,21,26-27H,7,9-10H2,1H3
charge 0 multiplicity 1
56 atoms
Cl 8.985079 -0.331803 2.948282
P  -5.182233 -3.200092 -0.107056
O  -2.787085 -0.647206 -0.163169
O  0.621814 -1.439399 0.687794
O  0.460673 0.838556 0.188112
O  -3.468223 -3.575484 -0.112821
O  -2.461239 2.483296 -2.338734
O  -5.671677 -3.564029 1.509987
O  -5.235691 -1.514559 -0.028861
O  -5.955081 -3.984402 -1.237391
O  -5.409768 4.980387 0.295889
N  -2.900496 1.735943 -0.139829
N  -3.926943 3.699145 -0.976524
N  6.81572 -0.035414 -0.580654
C  -0.748097 -1.062486 1.043866
C  -0.849677 0.472764 0.725264
C  -1.826647 -1.743742 0.154639
C  -1.999732 0.609556 -0.319072
C  1.071922 -0.428974 -0.316076
C  -2.569117 -2.890951 0.836474
C  2.558174 -0.334557 -0.376216
C  -3.059571 2.637795 -1.243785
C  -3.619708 1.899068 1.050878
C  3.245785 -0.551717 -1.591694
C  3.315396 -0.026005 0.781591
C  -4.470262 2.950215 1.261065
C  4.646999 -0.461754 -1.663695
C  4.713576 0.064794 0.728932
C  -4.670951 3.962153 0.220928
C  5.419484 -0.143078 -0.502497
C  7.626038 0.347934 0.586003
C  7.507997 -0.329458 -1.845439
C  7.979484 -0.882873 1.443129
H  -0.878131 -1.295198 2.11305
H  -1.020386 1.104737 1.610632
H  -1.372347 -2.103763 -0.78906
H  -1.590374 0.688165 -1.3435
H  0.624723 -0.675595 -1.303929
H  -3.120468 -2.538084 1.730715
H  -1.832021 -3.653085 1.144365
H  -3.480357 1.111206 1.795428
H  2.682384 -0.790469 -2.502579
H  2.796944 0.139872 1.731504
H  -4.051509 4.368901 -1.743313
H  -5.03107 3.051607 2.190212
H  5.136745 -0.629522 -2.62599
H  5.255578 0.295133 1.6506
H  7.094996 1.09465 1.201791
H  8.55697 0.830934 0.241206
H  -6.204876 -4.396642 1.580638
H  -4.358264 -1.033373 -0.230114
H  8.595696 -0.246027 -1.692416
H  7.220717 0.383356 -2.644194
H  7.292709 -1.354888 -2.204656
H  8.617156 -1.59907 0.904017
H  7.087541 -1.386068 1.843571
