program: Gaussian 09
title: 000170640
version: EM64L-G09RevD.01
frameworkgroup: C1[X(C11H17NO)]
method: RPBEPBE
basis: SDD
operation: Freq
keyword: #p
keyword: freq=noraman
keyword: PBEPBE/SDD
title: #p freq=noraman PBEPBE/SDD
converged: YES YES NO NO
title: Mulliken charges:
elementType: O N C C C C C C C C C C C H H H H H H H H H H H H H H H H H
charge: -0.429049 -0.087944 0.390885 -0.534366 0.356016 -0.625694 0.331243 -0.557651 0.122053 -0.843145 -0.620673 -0.615849 -0.863326 0.208734 0.198831 0.238003 0.253616 0.224881 0.219976 0.272692 0.252522 0.180217 0.219333 0.224337 0.187239 0.224032 0.230065 0.248616 0.231316 0.363089
chargesum: 0.00000
title: Mulliken charges with hydrogens summed into heavy atoms:
elementType: O N C C C C C C C C C C C
charge: -0.065960 -0.087944 0.390885 -0.126802 0.356016 -0.387692 0.331243 -0.304035 0.122053 -0.125595 0.031399 0.019759 -0.153328
polarizability: 1.72264554e+02 -7.77184950e+00 1.33508395e+02 8.53119932e+00 5.21378101e+00 8.71615415e+01
1716.lowfreq: -10.5493 -0.0010 -0.0009 -0.0005 6.2780 9.1300 54.6070 63.2086 78.9261
frequency: 54.5872 63.1909 78.9152 127.3952 134.3047 145.6169 199.0866 230.3866 241.9054 252.1305 264.8913 287.2964 298.8432 300.8517 315.4306 352.4190 371.1945 430.5864 447.7038 461.8414 520.0777 562.5961 621.0224 697.5029 726.8939 748.8345 798.4023 820.7794 877.3975 895.7582 961.1997 988.6385 1009.3493 1020.1806 1034.7404 1041.1583 1050.8938 1081.2379 1091.3475 1130.1610 1142.7101 1166.0108 1191.9683 1208.9039 1248.6848 1258.4635 1280.1396 1312.9823 1355.7390 1381.7075 1392.2953 1394.1104 1416.1807 1426.1505 1440.6539 1457.8349 1459.2132 1462.8933 1472.5604 1475.9360 1476.5661 1478.8747 1486.6709 1491.3930 1502.8401 1584.1343 1640.4162 2832.5275 2839.5935 2857.3163 2950.0602 2965.4660 2994.7031 3014.8132 3016.6835 3027.2673 3047.3517 3074.0405 3082.4967 3088.4880 3090.3442 3106.9018 3150.1576 3580.5968
redmass: 2.8244 3.3787 3.4577 2.7202 1.0384 1.0842 3.6525 1.2635 1.1444 1.7895 2.5581 2.1583 2.3617 2.0619 2.9977 1.9722 3.4183 2.9056 3.3879 2.8193 3.5251 4.0690 4.5134 3.9754 4.7809 4.2075 3.4545 3.3423 1.4144 1.4295 1.6199 1.6380 1.8558 1.7839 1.5417 1.5043 1.5399 3.2341 1.3801 1.4051 1.3786 1.8806 2.4474 2.0559 2.1268 1.6552 1.4357 3.6405 1.5017 4.7769 1.2599 1.2804 1.1456 2.5807 1.2105 1.0596 1.0495 1.0769 1.0726 1.0751 1.0472 1.1000 1.0650 1.2282 2.9040 6.3589 6.8891 1.0697 1.0575 1.0586 1.0399 1.0396 1.0864 1.0718 1.0979 1.0721 1.0930 1.1010 1.0944 1.1002 1.1001 1.0909 1.0917 1.0655
irintensity: 0.1413 0.3175 0.2740 1.1398 0.0557 0.1379 1.0647 2.8210 0.2285 31.6820 0.7627 9.8018 46.1007 49.9856 1.8408 11.7891 3.1314 1.2653 4.2967 6.2477 7.9892 1.0793 0.7738 2.0054 1.6247 5.4074 9.8677 23.2410 10.0966 22.4507 1.9204 51.3082 5.1263 27.0851 16.8562 3.0674 16.8152 84.3374 5.7235 4.6468 94.6772 3.9397 15.1227 64.9570 12.8099 6.2727 11.4426 6.6798 26.7634 6.1825 26.0399 0.3981 3.7561 2.2276 7.0079 9.2562 12.0700 7.3709 23.5338 25.1342 11.6890 1.8412 14.8411 22.0318 64.1895 41.5357 22.1220 53.0229 65.3692 262.8509 49.2536 32.5887 28.8435 44.5127 25.5409 37.2418 19.7406 34.3789 11.7816 14.6332 28.3812 18.6359 6.9818 33.2226
temp: 298.150 k
press: 1.00000 atm
elementType: 8 7 6 6 6 6 6 6 6 6 6 6 6 1 1 1 1 1 1 1 1 1 1 1 1 1 1 1 1 1
symmnumber: 1
zpe: 670277.2 jmol-1
zpe.correction: 0.255295 hartree
zpe.thermalcorrener: 0.269913 hartree
zpe.thermalcorrenthalpy: 0.270857 hartree
zpe.thermalcorrgfe: 0.214592 hartree
zpe.sumelectzpe: -558.324388 hartree
zpe.sumelectthermal: -558.309770 hartree
zpe.sumelectthermalent: -558.308826 hartree
zpe.sumelectthermalfe: -558.365092 hartree
dipole: -0.3506 -2.3765 -0.5685
dipole: 2.4686
quadrupole: -70.9065 -76.7042 -81.5935
quadrupole: -6.9779 0.7871 -0.9099
quadrupole: 5.4949 -0.3028 -5.1921 -6.9779 0.7871 -0.9099
hfenergy: -558.5796834 hartree
pointgroup: C01 [X(C11H17N1O1)]
dipole: -0.1896511 -0.895241 -0.3253335 debye
polarizability: 171.3670365|-10.7099497|132.8125259|7.3280653|9.9338499|88.7549274 unknown
InChI: InChI=1S/C11H17NO/c1-8-6-11(13)9(2)5-10(8)7-12(3)4/h5-6,13H,7H2,1-4H3
charge 0 multiplicity 1
30 atoms
O  3.68306 0.449819 0.573421
N  -2.788519 -0.154718 0.282616
C  -0.394036 -0.010296 -0.489056
C  -1.855057 -0.182645 -0.879611
C  0.097803 1.234584 0.012625
C  0.504706 -1.092662 -0.637079
C  1.877009 -1.00537 -0.302328
C  1.463663 1.336578 0.357038
C  2.338066 0.239676 0.202517
C  -0.81749 2.436067 0.165417
C  -2.560414 -1.26567 1.227817
C  -4.197016 -0.077335 -0.153284
C  2.825131 -2.180343 -0.469647
H  -2.164877 0.641378 -1.552927
H  -1.967915 -1.134195 -1.462459
H  0.12113 -2.045201 -1.026117
H  1.872138 2.274561 0.74729
H  -0.32511 3.247451 0.727879
H  -1.108477 2.84372 -0.82363
H  -1.748473 2.143253 0.682338
H  -1.514662 -1.24974 1.576918
H  -2.761161 -2.272119 0.776406
H  -3.221056 -1.145641 2.105234
H  -4.855114 0.016366 0.729222
H  -4.532124 -0.973487 -0.737039
H  -4.344439 0.816155 -0.786879
H  3.280662 -2.494769 0.491971
H  2.290076 -3.05733 -0.870236
H  3.650415 -1.957561 -1.176779
H  4.216078 -0.371823 0.433861
