program: Gaussian 09
title: 000170633
version: EM64L-G09RevD.01
frameworkgroup: C1[X(C13H11NO)]
method: RPBEPBE
basis: SDD
operation: Freq
keyword: #p
keyword: freq=noraman
keyword: PBEPBE/SDD
title: #p freq=noraman PBEPBE/SDD
converged: YES YES NO NO
title: Mulliken charges:
elementType: O N C C C C C C C C C C C C C H H H H H H H H H H H
charge: -0.181096 0.036068 0.346105 0.183032 -0.262456 0.404099 -0.405394 -0.373489 -0.451683 -0.676364 -0.246597 -0.427364 -0.269712 -0.242243 -0.028176 0.237178 0.251048 0.233219 0.241265 0.236116 0.232002 0.232937 0.231083 0.239779 0.229112 0.231532
chargesum: 0.00000
title: Mulliken charges with hydrogens summed into heavy atoms:
elementType: O N C C C C C C C C C C C C C
charge: -0.181096 0.036068 0.346105 0.183032 -0.025278 0.404099 -0.154346 -0.140269 -0.210418 0.024691 -0.015514 -0.187585 -0.040600 -0.010711 -0.028176
polarizability: 2.00073144e+02 -1.87114407e+01 1.58817128e+02 -4.49016120e+00 6.43901150e+00 8.47833542e+01
1716.lowfreq: -7.8716 -6.0441 -0.0010 -0.0007 0.0003 3.1793 31.4718 35.2276 99.8072
frequency: 31.4365 35.1757 99.8060 111.1656 175.0298 176.4863 203.1709 245.6826 292.0547 309.8349 389.1095 419.7706 445.5309 473.2225 494.5680 506.2595 517.9777 537.8378 573.1275 614.7833 652.3597 704.8449 745.3111 765.8860 786.4430 788.5374 814.8578 851.7371 876.7511 927.6150 960.7012 981.0310 987.3557 993.7215 1000.5230 1034.4978 1069.1916 1088.1887 1104.9109 1152.4152 1177.0540 1184.2670 1235.3838 1241.7358 1263.4005 1281.4615 1342.6743 1379.6590 1391.5118 1400.1105 1405.9440 1420.2385 1441.1322 1455.5992 1468.3223 1475.1036 1518.5656 1590.4965 1601.2695 1633.6488 2304.5479 2981.8328 2998.0981 3102.1087 3107.3812 3122.7398 3125.8551 3130.6211 3142.6072 3146.7278 3161.8852 3164.1499
redmass: 8.3386 6.7101 3.5804 4.7102 4.0752 3.9901 3.2731 1.1614 4.2368 5.2200 3.5118 4.3288 3.1454 3.2897 5.9300 10.9878 7.7914 10.0736 3.3250 5.0648 3.3185 3.8531 1.3268 3.4865 2.6460 3.2454 1.4833 3.7018 1.7080 1.3814 1.3878 2.5056 1.3602 1.3794 2.9291 2.2987 2.2115 1.9968 1.8987 1.4413 1.1128 1.2136 1.8751 1.9782 1.5478 1.5817 1.3268 1.7737 1.2855 7.3170 3.3315 4.4779 2.4407 2.3864 1.0470 1.0785 3.7078 7.5382 5.2890 6.5407 12.4869 1.0829 1.0348 1.1013 1.1006 1.0861 1.0867 1.0878 1.0912 1.0946 1.0988 1.1003
irintensity: 0.2377 0.7654 0.7805 3.5885 2.0435 2.3992 1.0016 0.3548 0.7507 2.5602 6.2562 3.1148 25.1514 1.7989 6.8128 10.7355 4.0329 15.5560 0.9809 6.0532 0.8710 1.1822 6.3246 9.3386 39.7457 33.0001 62.0212 1.8643 8.5519 0.0980 1.2273 9.2801 1.7924 2.3587 13.9946 2.5568 48.9177 2.2549 11.0734 5.2775 1.2744 2.7001 3.1222 12.9977 8.3874 1.8003 35.6797 5.9733 23.0578 2.5664 9.1225 10.1875 1.1342 0.2305 10.8528 4.5941 14.7763 0.2988 6.9031 1.5967 999.5770 16.4033 20.4138 34.3011 19.0187 2.1376 2.4253 1.7273 11.8831 40.1672 33.3437 17.3750
temp: 298.150 k
press: 1.00000 atm
elementType: 8 7 6 6 6 6 6 6 6 6 6 6 6 6 6 1 1 1 1 1 1 1 1 1 1 1
symmnumber: 1
zpe: 534342.2 jmol-1
zpe.correction: 0.203520 hartree
zpe.thermalcorrener: 0.216275 hartree
zpe.thermalcorrenthalpy: 0.217219 hartree
zpe.thermalcorrgfe: 0.163222 hartree
zpe.sumelectzpe: -630.925903 hartree
zpe.sumelectthermal: -630.913148 hartree
zpe.sumelectthermalent: -630.912204 hartree
zpe.sumelectthermalfe: -630.966201 hartree
dipole: 3.4479 -1.1579 1.3172
dipole: 3.8684
quadrupole: -96.2290 -76.0911 -92.5235
quadrupole: 3.6461 -8.5741 2.9106
quadrupole: -7.9478 12.1901 -4.2423 3.6461 -8.5741 2.9106
hfenergy: -631.1294229 hartree
pointgroup: C01 [X(C13H11N1O1)]
dipole: -1.3160147 -0.3925674 -0.6559591 debye
dipolederiv: -1.0956774 -0.158652 -0.6137695 -0.2985035 -0.3014599 -0.2127589 -0.715833 -0.1180985 -0.7533172 -1.2058619 -0.0933914 -0.4758571 -0.1399747 -0.3308075 -0.1856782 -0.977364 -0.2350464 -1.0317332 0.0699359 -0.1135605 -0.1308498 -0.1940148 -0.0172397 0.0009494 -0.1403885 0.0208508 -0.0978665 -0.0442765 0.1493186 0.0239391 0.2099877 -0.0073035 -0.0017153 0.0247546 -0.0160031 0.0011957 0.9885125 0.0334909 0.2498309 0.0916247 0.3126779 0.0685343 0.4446022 0.0098849 0.4919452 -0.0530248 0.0828299 0.0202222 0.089871 0.0116636 -0.0283128 0.0399965 -0.019976 0.0628318 0.0229095 0.0033635 -0.021298 0.0714897 -0.1126046 -0.0096254 0.0081646 0.0011467 -0.1411475 -0.0401914 -0.073156 -0.0400965 -0.0894837 0.0083433 0.0392609 -0.0271228 0.0293465 -0.1448136 -0.0030785 -0.0975239 -0.0464217 -0.0283164 0.0221081 0.0276323 -0.0298225 0.0436855 -0.170805 -0.0905696 0.0210495 0.0112813 0.0141633 0.0422151 -0.0351293 -0.0608675 -0.0032065 -0.0456399 -0.0719725 0.0090163 -0.0077186 -0.0484732 0.1436962 0.0357881 -0.0189079 0.0406734 -0.1384911 0.0591135 -0.039199 -0.0425851 -0.1009068 0.0288648 0.0438595 -0.0495353 0.0334665 -0.1577471 -0.0597286 -0.0230775 -0.0163837 -0.0162585 0.1345148 0.0405251 -0.0224898 0.0436815 -0.1533897 0.1152188 0.0102687 -0.0434284 0.0337148 -0.1076142 0.0033189 -0.0379102 0.006319 -0.1520088 1.5606349 0.2487406 0.9762538 0.3939405 0.3422291 0.3255753 1.3843044 0.2692256 1.2893578 -0.0468331 -0.0561161 -0.0540486 -0.0432796 -0.0858022 0.0325088 -0.0057147 0.0670099 -0.0211596 -0.0498251 -0.0654306 0.024266 -0.0940103 0.0899008 -0.0134733 0.0188515 -0.004151 0.1316187 -0.01599 0.1191032 0.0424163 0.1009656 0.0018621 -0.0339193 0.0383207 -0.0398503 0.126585 -0.034453 0.1192713 0.0419355 0.0550051 0.0085547 -0.0267433 0.0377608 -0.0382121 0.1458393 0.1069991 -0.0161365 0.0380615 -0.0466888 -0.0565477 0.112167 0.0093268 0.0375583 0.0402173 -0.0799279 -0.0804378 -0.0865331 -0.0842698 0.0657081 -0.0352986 -0.0898285 0.0062523 0.0682611 -0.0418822 0.131308 0.0712352 0.1572047 -0.0164983 -0.054099 0.0851206 -0.0456826 0.0440211 0.0717156 -0.0490312 0.0053704 -0.02593 -0.1179533 -0.0259281 0.0037433 -0.0274742 0.1522355 -0.0215111 0.0541322 0.0326611 0.1237864 -0.0074862 -0.0396712 0.042161 -0.0300438 0.1438413 0.0741774 -0.043656 0.0082693 -0.058464 -0.118683 -0.0266156 0.0042984 -0.0283637 0.1536079 -0.1144138 -0.072524 0.0332476 -0.0731794 0.0676617 -0.0011511 0.0343794 -0.0029928 0.1565613 unknown
polarizability: 196.7895342|22.0360464|159.5206021|2.2932587|15.4406225|87.3634896 unknown
InChI: InChI=1S/C13H11NO/c1-10(14-9-15)12-8-4-6-11-5-2-3-7-13(11)12/h2-8,10H,1H3
charge 0 multiplicity 1
26 atoms
O  4.610473 0.375806 1.506187
N  2.96241 -0.218717 -0.185418
C  0.517482 0.243275 -0.253569
C  -0.833061 -0.255433 -0.111221
C  1.66093 -0.725538 -0.601171
C  -1.899054 0.688893 0.175807
C  0.765935 1.613571 -0.122695
C  -1.181138 -1.644974 -0.238703
C  -1.596069 2.08429 0.303673
C  1.707242 -1.015883 -2.12406
C  -0.286589 2.538064 0.155163
C  -3.243136 0.211169 0.327146
C  -2.49977 -2.079623 -0.08543
C  -3.543761 -1.145351 0.200177
C  3.734375 0.057232 0.716592
H  1.493411 -1.681982 -0.066395
H  1.790123 1.985638 -0.230605
H  -0.406715 -2.386739 -0.460489
H  -2.409985 2.786135 0.520394
H  1.914442 -0.084781 -2.677968
H  0.738189 -1.416168 -2.466502
H  2.500957 -1.747436 -2.353708
H  -0.054304 3.603822 0.252695
H  -4.03555 0.937002 0.545742
H  -2.738974 -3.144205 -0.183963
H  -4.573565 -1.499268 0.31792
