program: Gaussian 09
title: 000170652
version: EM64L-G09RevD.01
frameworkgroup: C1[X(C21H28O2)]
method: RPBEPBE
basis: SDD
operation: Freq
keyword: #pfreq=noraman
keyword: PBEPBE/SDD
title: #p freq=noraman PBEPBE/SDD
converged: YES YES NO NO
title: Mulliken charges:
elementType: O O C C C C C C C C C C C C C C C C C C C C C H H H H H H H H H H H H H H H H H H H H H H H H H H H H
charge: -0.463456 -0.235075 0.246321 -0.181370 0.232262 -0.213867 -0.521897 -0.494795 0.241440 -0.197020 -0.487064 -0.823014 -0.804465 -0.415544 0.122025 -0.587015 0.376900 -0.596706 0.198045 -0.546673 0.148920 -0.748443 -0.732054 0.282073 0.221130 0.212437 0.230061 0.216626 0.215499 0.240555 0.228009 0.212358 0.231998 0.243456 0.225017 0.238581 0.232874 0.209373 0.214439 0.244432 0.219506 0.328318 0.230435 0.210235 0.248191 0.203680 0.252116 0.213010 0.235240 0.212995 0.229902
chargesum: 0.00000
title: Mulliken charges with hydrogens summed into heavy atoms:
elementType: O O C C C C C C C C C C C C C C C C C C C C C
charge: -0.135138 -0.235075 0.246321 0.100703 0.232262 0.007263 -0.079399 -0.062670 0.241440 0.043535 -0.046697 -0.122544 -0.123637 -0.201105 0.122025 -0.123076 0.376900 -0.156037 0.198045 -0.298482 0.148920 -0.079636 -0.053917
polarizability: 3.87328451e+02 2.00910594e+01 2.10727149e+02 5.24980921e+00 -5.10513213e-01 1.61659669e+02
1716.lowfreq: -0.0009 -0.0007 -0.0003 2.9723 7.8209 14.2947 29.2505 45.9784 82.3488
frequency: 28.6737 45.9399 82.3380 86.6354 103.5399 114.7359 145.7768 179.5601 186.5017 200.8353 207.7502 222.3911 225.9329 235.2047 238.2231 244.8216 258.2944 280.9517 293.6370 301.5386 316.8964 323.7944 330.7292 348.8130 362.6561 373.2742 391.7458 416.9728 429.2957 452.3723 471.2935 489.4346 516.4949 533.2054 578.9228 584.4899 593.4029 619.0489 630.5577 645.8528 690.4261 698.2239 708.6778 718.1204 747.2986 785.2688 789.6008 821.2292 839.8309 855.7924 858.3321 889.6119 895.5295 903.7403 929.2360 942.1623 946.0214 949.1923 961.7375 983.0898 985.9365 993.9535 1004.8963 1019.7398 1037.5731 1042.6669 1064.6627 1090.0249 1097.9677 1108.6536 1116.5851 1127.8870 1142.7463 1149.8407 1156.2041 1158.3482 1187.6087 1190.8746 1210.9298 1215.4821 1224.4458 1225.9671 1230.5212 1235.0364 1254.7591 1272.8097 1275.4541 1288.5394 1296.8381 1305.4608 1328.8212 1330.4854 1336.9651 1343.5508 1353.2125 1370.3333 1374.2931 1379.9866 1388.1271 1389.1228 1392.8859 1398.1656 1446.6737 1451.7986 1456.8951 1460.7849 1462.9158 1465.6950 1466.8352 1473.9229 1474.2814 1476.0778 1485.0927 1485.4414 1494.9932 1543.3237 1568.5720 1572.6740 1602.5003 2918.2835 2954.5741 2954.9292 2973.2319 2974.1834 2979.1434 2980.9611 2992.4150 2995.7816 2997.7077 3008.8703 3030.9234 3045.4864 3045.7209 3058.0504 3059.6790 3067.3982 3067.6960 3071.6214 3072.6602 3083.8996 3086.5524 3093.2346 3096.7545 3115.9707 3121.8819 3143.7810 3551.8069
redmass: 4.6685 3.9012 3.4150 3.6134 3.2484 2.8217 3.6997 1.1029 3.8037 2.1844 1.9536 2.5578 1.1727 1.5514 1.7466 1.9473 2.3885 1.0682 2.4687 2.8666 1.6876 3.2481 3.0529 2.5806 3.0061 2.8075 3.3790 3.0447 3.6611 3.7834 3.4758 3.4874 3.3481 3.7710 3.2728 3.0185 3.8288 3.7645 3.9780 3.9310 3.5214 3.9957 3.0975 3.3654 1.7637 1.8789 2.9225 2.4356 2.1452 2.1407 2.2376 2.1503 1.6811 1.9181 1.9820 1.4756 1.6716 1.6193 1.6340 2.2013 2.0647 1.9158 1.4612 2.1661 1.7444 2.2979 1.6040 2.3580 2.5479 2.7984 1.7701 1.7211 2.0166 1.9417 1.9247 2.1140 1.9408 1.7408 1.7962 1.9636 2.6144 1.7013 1.5245 1.6171 1.5558 1.4790 1.9921 1.6632 1.6453 1.4334 1.5210 1.5263 1.7147 1.4612 1.4263 1.2034 1.3130 1.3406 1.3657 1.5936 2.2057 1.4455 1.0806 1.1088 1.0744 1.0586 1.0590 1.0522 1.0594 1.0598 1.0896 1.0541 1.0871 1.0770 1.0706 8.7436 8.5865 6.7264 7.5649 1.0813 1.0659 1.0671 1.0349 1.0378 1.0364 1.0369 1.0670 1.0727 1.0617 1.0631 1.0926 1.0917 1.1026 1.1028 1.0974 1.0999 1.1016 1.0988 1.1007 1.1004 1.0993 1.0981 1.0983 1.0841 1.0908 1.0977 1.0660
irintensity: 0.7273 1.9298 0.3687 0.8011 0.9368 0.4869 1.7289 0.1955 1.0703 0.8675 1.0121 0.4846 1.0130 4.5496 2.3693 1.1078 2.5799 122.3876 2.9606 4.8065 2.4433 4.1675 5.5233 3.5264 5.5336 2.3905 2.2811 0.6527 2.8380 5.3211 4.8190 0.5848 2.6110 3.5557 1.8280 1.4413 9.0293 1.9854 0.0381 4.0205 9.0012 4.6851 0.9629 1.8659 32.3704 5.9208 2.9968 13.8758 2.8680 13.3366 4.6984 17.9720 8.4613 14.4193 5.6501 1.6314 8.3347 3.3711 4.7262 5.0563 4.5237 0.4641 0.9676 20.5541 9.4333 9.2369 68.1461 8.4256 12.7350 18.5859 3.0467 4.4135 24.9597 19.8409 6.4332 44.3077 3.6198 9.0612 27.5661 9.9058 37.8506 11.8441 23.7075 19.8665 7.6939 24.7451 39.8992 1.0901 4.8980 4.5355 5.2171 9.1663 5.6687 3.9329 7.2060 18.1901 0.5082 11.1768 37.7756 36.8780 14.1759 14.0151 6.7387 7.2009 6.9286 4.0460 3.6101 7.0711 12.2376 13.9001 4.2431 12.2492 8.4270 9.6537 3.7189 103.8350 29.7830 412.3486 11.6638 15.6764 17.5169 24.3788 25.1622 24.8922 38.9295 28.2490 34.7059 23.2692 12.9134 55.9139 31.0840 13.1893 3.6375 28.9164 31.9573 12.4413 72.7858 43.3276 22.2999 22.5905 26.0297 31.6382 18.1506 1.1998 9.4381 25.2214 4.5233
temp: 298.150 k
press: 1.00000 atm
elementType: 8 8 6 6 6 6 6 6 6 6 6 6 6 6 6 6 6 6 6 6 6 6 6 1 1 1 1 1 1 1 1 1 1 1 1 1 1 1 1 1 1 1 1 1 1 1 1 1 1 1 1
symmnumber: 1
zpe: 1148628.5 jmol-1
zpe.correction: 0.437490 hartree
zpe.thermalcorrener: 0.459695 hartree
zpe.thermalcorrenthalpy: 0.460639 hartree
zpe.thermalcorrgfe: 0.388693 hartree
zpe.sumelectzpe: -965.720918 hartree
zpe.sumelectthermal: -965.698713 hartree
zpe.sumelectthermalent: -965.697769 hartree
zpe.sumelectthermalfe: -965.769715 hartree
dipole: -7.9150 0.1429 -0.0137
dipole: 7.9163
quadrupole: -158.2255 -132.7364 -138.9958
quadrupole: -6.8479 -4.4122 -2.2438
quadrupole: -14.9062 10.5828 4.3235 -6.8479 -4.4122 -2.2438
hfenergy: -966.1584079 hartree
pointgroup: C01 [X(C21H28O2)]
dipole: 3.1129681 -0.0977831 0.0083116 debye
polarizability: 387.8766992|17.7678592|210.2058268|-4.0077119|1.1332178|161.6327428 unknown
InChI: InChI=1S/C21H28O2/c1-19(2)12-16-13(11-18(19)22)5-6-15-14(16)7-9-20(3)17(15)8-10-21(20,4)23/h7,9,11,15,17,23H,5-6,8,10,12H2,1-4H3
charge 0 multiplicity 1
51 atoms
O  4.283827 1.301087 -1.276468
O  -5.623955 -0.555651 0.37568
C  2.7409 0.443581 0.366756
C  2.275703 -0.644297 -0.653913
C  4.261643 0.540769 0.007565
C  0.768153 -1.000965 -0.593593
C  3.352003 -1.751069 -0.532581
C  4.671807 -0.953749 -0.247835
C  -0.091042 0.229031 -0.2165
C  1.907536 1.680224 0.110399
C  0.338852 -2.215415 0.267861
C  2.559911 0.013495 1.853531
C  5.164958 1.266207 1.016389
C  0.56662 1.540596 -0.141563
C  -1.446639 0.056682 0.057168
C  -1.146272 -2.513597 -0.021896
C  -2.041898 -1.282678 0.094679
C  -2.375739 1.193423 0.468268
C  -3.823661 1.066533 -0.088325
C  -3.407592 -1.448795 0.257028
C  -4.376277 -0.34708 0.223487
C  -4.731029 2.144845 0.54514
C  -3.825083 1.227691 -1.638926
H  2.436928 -0.157487 -1.63597
H  0.47975 -1.270673 -1.634966
H  3.421782 -2.363937 -1.448897
H  3.129691 -2.437831 0.304354
H  5.203985 -1.367043 0.628569
H  5.371453 -1.005119 -1.102876
H  2.371675 2.672182 0.158838
H  0.486623 -2.006865 1.343898
H  0.947916 -3.102796 0.013214
H  2.891499 0.816403 2.535809
H  1.495283 -0.175622 2.068134
H  3.131469 -0.901018 2.097964
H  4.835188 2.311792 1.15397
H  5.17194 0.767556 2.000852
H  6.210669 1.286672 0.651538
H  -0.049556 2.44089 -0.246793
H  -1.534193 -3.310527 0.639922
H  -1.228481 -2.905618 -1.05846
H  5.219851 1.339315 -1.600137
H  -2.433996 1.215759 1.577806
H  -1.975268 2.175414 0.160517
H  -3.834226 -2.453921 0.370172
H  -4.404983 3.155616 0.236001
H  -5.777466 1.994084 0.23142
H  -4.70418 2.092403 1.64941
H  -4.849655 1.110701 -2.034536
H  -3.458722 2.23544 -1.912103
H  -3.175006 0.480664 -2.129004
