program: Gaussian 09
title: 000170629
version: EM64L-G09RevD.01
frameworkgroup: C1[X(C18H14N2)]
method: RPBEPBE
basis: SDD
operation: Freq
keyword: #pfreq=noraman
keyword: PBEPBE/SDD
title: #p freq=noraman PBEPBE/SDD
converged: YES YES NO NO
title: Mulliken charges:
elementType: N N C C C C C C C C C C C C C C C C C C H H H H H H H H H H H H H H
charge: -0.447374 -0.062558 -0.692245 0.420546 0.167100 0.181339 0.390081 0.286168 -0.017847 -0.473885 -0.378099 -0.456896 -0.246606 -0.432788 -0.378171 -0.345061 -0.262654 -0.240694 -0.215616 -0.234023 0.262242 0.244852 0.322649 0.242405 0.268578 0.241041 0.229512 0.238398 0.232601 0.247420 0.232221 0.230206 0.222796 0.224362
chargesum: 0.00000
title: Mulliken charges with hydrogens summed into heavy atoms:
elementType: N N C C C C C C C C C C C C C C C C C C
charge: -0.124725 -0.062558 -0.185150 0.420546 0.167100 0.181339 0.390081 0.286168 -0.017847 -0.231479 -0.109522 -0.215855 -0.017094 -0.194390 -0.145570 -0.097641 -0.030433 -0.010488 0.007180 -0.009661
polarizability: 2.48812352e+02 -2.40095091e+01 2.08516456e+02 1.45352800e+01 -9.85110896e+00 1.57683406e+02
1716.lowfreq: -8.5563 -4.0739 -0.0002 0.0004 0.0007 3.8771 23.3345 25.6852 40.0138
frequency: 23.2924 25.6313 40.0001 110.4825 131.4765 177.1502 205.1613 252.5369 253.5484 272.8772 326.3811 409.5296 422.8521 430.7838 448.8562 472.0972 497.0658 502.0525 516.2778 554.2753 580.8922 597.3335 613.4151 626.1015 641.2584 654.0045 703.8022 727.6573 751.9139 754.7775 772.9218 785.0648 794.5620 813.1409 825.0928 857.7374 861.1928 880.2214 888.2988 917.9341 935.5570 936.4770 967.5197 969.3939 975.3460 987.4552 998.5546 1008.7122 1021.9800 1044.3939 1078.1998 1109.5547 1149.1005 1158.9882 1165.6098 1174.3257 1183.7431 1200.8532 1216.5364 1236.0574 1243.7337 1258.9189 1276.8208 1301.6204 1306.8490 1365.2886 1381.2964 1407.1487 1413.2827 1420.2726 1440.9440 1444.9240 1455.7588 1465.1066 1475.0377 1516.6963 1518.7752 1589.5002 1594.1749 1598.6506 1633.2924 1634.6844 2989.0381 3054.5703 3116.4932 3122.3541 3127.5364 3129.2131 3135.7090 3141.5126 3149.9431 3156.3032 3156.7654 3165.2349 3170.3606 3584.0146
redmass: 4.6868 5.1023 5.0068 5.0651 4.9659 4.1510 4.9516 4.5032 4.6350 3.4617 3.2952 3.6185 3.1243 3.0131 3.9092 3.2672 5.7709 5.9778 4.4397 4.8545 3.6208 4.3371 5.9727 1.3376 3.9171 3.3790 4.5379 2.8137 1.4783 1.3895 3.6074 4.4689 2.1161 2.1063 2.5654 1.5292 3.5126 3.8646 2.0654 1.6273 1.7169 1.5056 1.6109 3.5310 1.3043 1.3746 1.3407 2.1001 3.3137 2.5894 2.2046 1.6323 1.4245 1.1530 1.2711 1.1871 1.1951 2.0930 1.7326 1.7124 1.7739 2.6207 1.6475 2.4601 1.6899 2.8829 2.1601 3.0825 2.9301 5.2872 2.2966 3.4045 2.4562 1.1576 3.4666 4.4284 4.1913 7.5704 6.9180 5.2967 6.5013 7.5451 1.0642 1.0958 1.0877 1.0865 1.0900 1.0853 1.0887 1.0904 1.0948 1.0989 1.0957 1.1004 1.0994 1.0813
irintensity: 2.8569 0.9084 0.3799 1.9404 0.5580 2.4411 2.2040 3.7456 4.8932 3.2261 0.3438 1.8332 8.2632 10.3129 9.3760 0.1358 2.0692 2.1295 2.5285 2.6336 1.0483 10.2101 2.1654 62.0188 0.2529 17.6826 0.1137 11.1226 7.2482 102.8854 4.5599 5.7553 62.0628 76.5712 9.1125 0.1082 0.5818 0.5928 3.0473 1.2321 0.3826 3.9789 2.5809 0.8138 0.0676 5.4832 0.0727 7.4517 6.9444 1.3692 7.5166 5.0285 0.3922 2.6465 8.4102 2.7939 1.8651 18.4364 5.6555 5.0777 2.8847 32.4633 6.5465 17.5676 4.1368 52.5144 16.3928 4.4913 3.4257 1.6235 9.4620 45.3200 0.5018 15.5473 0.3353 62.2551 24.5278 0.8104 2.1003 6.3583 0.5575 8.0784 20.2446 3.0937 8.9705 1.2931 13.0602 0.3394 8.4154 11.6669 22.3966 35.2153 26.9425 21.4517 22.8171 40.3842
temp: 298.150 k
press: 1.00000 atm
elementType: 7 7 6 6 6 6 6 6 6 6 6 6 6 6 6 6 6 6 6 6 1 1 1 1 1 1 1 1 1 1 1 1 1 1
symmnumber: 1
zpe: 709264.9 jmol-1
zpe.correction: 0.270145 hartree
zpe.thermalcorrener: 0.284918 hartree
zpe.thermalcorrenthalpy: 0.285862 hartree
zpe.thermalcorrgfe: 0.226490 hartree
zpe.sumelectzpe: -802.496196 hartree
zpe.sumelectthermal: -802.481423 hartree
zpe.sumelectthermalent: -802.480479 hartree
zpe.sumelectthermalfe: -802.539851 hartree
dipole: 2.0122 -1.3366 2.5703
dipole: 3.5273
quadrupole: -111.3501 -104.9901 -115.5370
quadrupole: -1.7743 -0.1229 -2.5231
quadrupole: -0.7244 5.6356 -4.9112 -1.7743 -0.1229 -2.5231
hfenergy: -802.7663408 hartree
pointgroup: C01 [X(C18H14N2)]
dipole: 0.6439588 -0.8690159 0.8694637 debye
polarizability: 239.9131693|-31.2888255|218.1506768|11.7500843|1.6369105|156.9483672 unknown
InChI: InChI=1S/C18H14N2/c1-2-9-15-13(6-1)7-5-8-14(15)12-18-19-16-10-3-4-11-17(16)20-18/h1-11,19H,12H2
charge 0 multiplicity 1
34 atoms
N  -1.47188 -0.926967 -0.057408
N  -1.809322 0.627769 -1.692481
C  0.261464 -0.819759 -1.922533
C  1.411681 -1.119975 -0.964838
C  2.080139 -0.055561 -0.248067
C  -0.998852 -0.345865 -1.242412
C  3.170623 -0.387099 0.649948
C  -2.670644 -0.283828 0.285725
C  -2.870859 0.6881 -0.756187
C  1.827807 -2.443884 -0.771485
C  1.709852 1.324453 -0.394324
C  3.55907 -1.758338 0.815753
C  2.89975 -2.769501 0.118059
C  3.843692 0.664781 1.355127
C  -3.571883 -0.43809 1.358594
C  -4.006235 1.52853 -0.727569
C  2.385547 2.326852 0.306667
C  3.462055 1.997343 1.188643
C  -4.699296 0.412165 1.368062
C  -4.913555 1.379047 0.342184
H  0.532829 -0.040227 -2.65642
H  0.034847 -1.732902 -2.506869
H  -0.982238 -1.644151 0.476303
H  1.329548 -3.249334 -1.32541
H  0.8814 1.595992 -1.056578
H  4.384676 -1.997328 1.496735
H  3.200898 -3.815413 0.240991
H  4.668151 0.403297 2.029388
H  -3.415871 -1.176973 2.151689
H  -4.165284 2.268352 -1.517994
H  2.088492 3.373906 0.182736
H  3.982924 2.793756 1.731416
H  -5.426998 0.327274 2.182792
H  -5.802826 2.017078 0.38936
