program: Gaussian 09
title: 000170644
version: EM64L-G09RevD.01
frameworkgroup: C1[X(C13H11Br2N2O4S)]
method: RPBEPBE
basis: SDD
operation: Freq
keyword: #p
keyword: freq=noraman
keyword: PBEPBE/SDD
title: #p freq=noraman PBEPBE/SDD
converged: YES YES NO NO
title: Mulliken charges:
elementType: Br Br S O O O O N N C C C C C C C C C C C C C H H H H H H H H H H H
charge: -0.008325 0.037045 0.976594 -0.402173 -0.466296 -0.451342 -0.364637 0.028262 0.159668 0.501049 -0.232807 0.405289 -0.241695 -0.347338 -0.348026 -0.040746 -0.218163 -0.240236 -0.422461 0.295674 -0.377349 -0.639391 0.323917 0.324774 0.223310 0.278307 0.275906 0.342521 0.284942 0.293856 0.320503 0.309409 0.419960
chargesum: 1.00000
title: Mulliken charges with hydrogens summed into heavy atoms:
elementType: Br Br S O O O O N N C C C C C C C C C C C C C
charge: -0.008325 0.037045 0.976594 -0.402173 -0.466296 -0.451342 0.055323 0.028262 0.159668 0.501049 -0.232807 0.405289 0.082222 -0.022565 -0.124716 -0.040746 0.336050 0.044706 -0.079940 0.295674 -0.083493 -0.009479
polarizability: 2.85286253e+02 -7.52998560e+01 2.96119340e+02 -2.91311279e+01 -2.13797210e+01 1.60680034e+02
1716.lowfreq: -11.4907 -6.7918 -2.1117 0.0003 0.0007 0.0009 3.9919 16.4940 21.9430
frequency: -5.7047 16.3649 21.9149 26.7910 53.6630 72.9173 81.5429 93.3800 112.5396 137.4339 139.5737 150.6300 174.0264 186.6027 202.5067 212.7907 226.4359 229.3667 264.1227 285.0869 310.0176 326.7670 352.7700 393.2538 403.1601 436.9545 437.3549 439.6765 466.7784 489.4929 499.4568 520.9034 539.3934 560.1680 579.7693 599.4172 631.4944 643.7380 668.3667 673.6614 750.3415 757.5330 808.4252 828.4612 841.2751 849.2085 859.8122 867.4225 914.5722 941.2928 946.1945 956.9357 968.5325 999.0641 1009.0958 1074.1015 1081.7432 1116.3617 1129.8106 1132.3900 1168.7717 1179.7583 1209.8949 1223.1065 1224.3269 1244.8589 1259.4390 1273.0654 1330.6227 1360.7528 1371.0342 1388.1541 1421.9109 1435.2935 1439.5959 1444.6662 1453.7034 1492.0401 1552.6264 1589.4015 1614.9376 2097.3222 3001.8866 3074.6445 3082.3399 3086.4725 3122.1813 3147.0983 3174.3044 3175.3096 3185.3775 3190.7363 3583.9097
redmass: 18.4704 15.4688 9.2074 10.8178 9.2071 9.1106 6.9292 13.0500 10.0107 6.0199 3.2583 9.4823 23.7944 4.7031 5.3161 10.5883 7.3754 5.7420 5.5360 7.1591 2.6919 5.9561 9.1039 8.0236 1.3649 4.5738 8.8686 4.5462 6.5276 6.4689 6.0218 5.3304 3.9904 6.8413 4.3795 5.4085 7.2101 4.6215 6.7552 3.3752 6.9804 1.7753 1.6066 7.1034 3.4924 4.9607 3.0822 2.4198 3.7585 2.2282 1.3801 1.8569 3.9548 1.6877 1.3986 2.2143 4.2646 1.5685 1.6150 1.3401 1.2999 1.4111 1.4679 1.2181 2.4890 1.1757 1.7252 2.1172 1.5583 1.2428 3.2066 2.5883 5.9406 2.8271 1.1022 2.8067 1.0718 4.3405 7.0013 6.2277 6.5570 13.8951 1.0556 1.1081 1.0685 1.0746 1.0909 1.0925 1.0900 1.1123 1.0973 1.0996 1.0670
irintensity: 0.8622 0.1403 2.5356 0.1555 1.3325 1.4829 1.1246 1.1179 2.9618 4.2202 1.4645 2.4560 0.3486 15.0843 4.6576 1.9154 5.3924 1.4935 0.9432 3.2128 7.5269 1.1449 5.2349 2.3369 103.9438 42.4512 29.7668 15.1942 86.7760 25.6231 49.6731 60.9861 12.6485 5.1704 8.9377 43.5857 39.2050 18.0329 2.5674 0.4139 4.7378 19.1482 63.9418 108.6303 11.9811 12.2866 14.1798 92.5546 26.0680 28.5572 2.6610 20.6172 38.7634 13.7897 0.3858 0.1460 72.7620 14.1418 122.5564 10.2884 4.2791 2.9776 1.7385 3.5260 46.9455 10.5619 10.3233 48.5746 9.5482 6.3545 116.1150 7.8126 148.0454 34.1199 12.2433 13.0996 34.5209 45.3017 33.6461 39.9529 233.2131 477.3467 18.7608 1.0737 1.2757 1.3236 5.2841 15.8212 24.2978 0.8055 1.9173 10.7084 130.9128
temp: 298.150 k
press: 1.00000 atm
elementType: 35 35 16 8 8 8 8 7 7 6 6 6 6 6 6 6 6 6 6 6 6 6 1 1 1 1 1 1 1 1 1 1 1
symmnumber: 1
zpe: 580741.5 jmol-1
zpe.correction: 0.221193 hartree
zpe.thermalcorrener: 0.242723 hartree
zpe.thermalcorrenthalpy: 0.243667 hartree
zpe.thermalcorrgfe: 0.167130 hartree
zpe.sumelectzpe: -1335.293140 hartree
zpe.sumelectthermal: -1335.271610 hartree
zpe.sumelectthermalent: -1335.270665 hartree
zpe.sumelectthermalfe: -1335.347203 hartree
dipole: 16.4016 -0.4131 -4.6663
dipole: 17.0575
quadrupole: -66.1705 -123.6440 -149.5635
quadrupole: 3.2299 -23.5518 -13.8079
quadrupole: 46.9555 -10.5180 -36.4375 3.2299 -23.5518 -13.8079
hfenergy: -1335.5143328 hartree
pointgroup: C01 [X(C13H11Br2N2O4S1)]
dipole: -6.5617441 -0.9203833 -1.0644071 debye
polarizability: 311.4701768|-69.043144|279.311217|17.1796975|19.9869497|151.3042326 unknown
InChI: InChI=1S/C13H11Br2N2O4S/c14-6-8(15)7-21-22(19,20)12-3-1-2-10-9(12)4-5-11(17-16)13(10)18/h1-5,8,18H,6-7H2
charge 1 multiplicity 1
33 atoms
Br 2.296774 3.2097 0.104102
Br 5.45408 0.544598 -2.27908
S  1.800709 -1.21919 1.495427
O  2.481172 -0.069371 0.199982
O  1.475404 -0.340682 2.816439
O  2.65772 -2.58042 1.600132
O  -4.217737 -0.363882 -1.262566
N  -3.949656 2.060084 -0.271448
N  -4.833032 2.792239 -0.447498
C  -0.803856 -0.627021 0.340803
C  0.218786 -1.603806 0.507941
C  -1.979455 -1.064118 -0.400677
C  0.152122 -2.900666 0.006328
C  -0.716327 0.720695 0.853262
C  -2.052333 -2.400521 -0.918653
C  -3.045598 -0.125431 -0.597412
C  3.691444 0.671546 0.645323
C  -1.007909 -3.303386 -0.720505
C  3.83389 1.890028 -0.267608
C  -2.913119 1.195443 -0.066043
C  -1.742842 1.62322 0.659476
C  3.804681 1.61546 -1.768501
H  0.981562 -3.596342 0.179456
H  0.171466 1.034311 1.407007
H  -2.928376 -2.745943 -1.481325
H  3.585302 0.988478 1.698936
H  4.578635 0.022301 0.525122
H  4.73005 2.46067 0.027336
H  -1.070415 -4.319461 -1.118618
H  -1.683545 2.645707 1.04115
H  3.870479 2.540464 -2.356369
H  2.943336 1.003277 -2.067664
H  -4.325614 -1.277882 -1.627357
