program: Gaussian 09
title: 000170715
version: EM64L-G09RevD.01
frameworkgroup: C1[X(C21H18N4O8S2)]
method: RPBEPBE
basis: SDD
operation: Freq
keyword: #p
keyword: freq=noraman
keyword: PBEPBE/SDD
title: #p freq=noraman PBEPBE/SDD
converged: YES YES NO NO
title: Mulliken charges:
elementType: S S O O O O O O O O N N N N C C C C C C C C C C C C C C C C C C C C C H H H H H H H H H H H H H H H H H H
charge: 0.952863 0.943178 -0.563923 -0.568289 -0.492427 -0.489938 -0.498830 -0.504909 -0.202653 -0.196643 0.024619 -0.121962 -0.098182 -0.397945 0.634467 0.592486 -0.282564 -0.252633 -0.281159 -0.249848 -0.426422 -0.350740 -0.351069 -0.360091 0.417502 0.182457 -0.401885 -0.389114 0.146401 0.463484 -0.312633 -0.292813 -0.386107 -0.321312 -0.633397 0.254789 0.250993 0.345000 0.335486 0.271763 0.258355 0.295515 0.260298 0.384920 0.381475 0.259174 0.275545 0.225503 0.243437 0.311068 0.242516 0.231697 0.242500
chargesum: 0.00000
title: Mulliken charges with hydrogens summed into heavy atoms:
elementType: S S O O O O O O O O N N N N C C C C C C C C C C C C C C C C C C C C C
charge: 0.952863 0.943178 -0.179003 -0.186814 -0.492427 -0.489938 -0.498830 -0.504909 -0.202653 -0.196643 0.024619 -0.121962 -0.098182 -0.086878 0.634467 0.592486 -0.282564 -0.252633 -0.026371 0.001145 -0.081422 -0.015254 -0.079306 -0.101736 0.417502 0.182457 -0.106369 -0.128816 0.146401 0.463484 -0.053459 -0.017268 -0.160604 -0.077875 0.083315
polarizability: 1.40421678e+03 -6.38978048e+01 3.66108213e+02 -1.20927444e+00 -3.76860639e+00 1.65377832e+02
1716.lowfreq: -0.0018 -0.0014 -0.0009 2.0210 2.9178 4.5171 11.5766 16.5916 18.3040
frequency: 11.1965 16.5497 18.2660 20.9061 33.8120 39.4883 43.8079 45.8659 53.6488 55.8338 71.7110 101.5880 103.2752 108.6148 112.3599 119.9238 137.3398 141.9755 160.0416 163.7090 170.9009 180.4874 193.1033 202.0539 210.2122 219.6086 228.0765 233.8134 243.2483 244.9959 251.0162 279.2263 285.9311 298.2265 308.9868 318.2895 333.6003 338.8887 363.0399 364.1482 395.5103 406.1985 421.5829 427.0641 429.3127 451.4168 458.4952 465.1523 470.4228 486.7811 520.0322 527.7590 530.9680 539.7320 543.2904 553.9133 556.9189 613.1222 617.1417 628.7379 640.6715 662.8576 682.5965 690.6751 720.7554 743.4153 754.4033 768.3611 782.1400 813.3923 814.0285 828.0799 834.1050 841.4606 846.7353 847.6293 858.5986 864.0103 888.7748 904.8122 932.6150 949.1369 956.1737 957.6821 964.6678 970.1314 984.5920 987.4613 990.0050 996.3817 1003.5530 1008.1219 1037.9468 1042.1151 1065.3226 1100.4160 1105.3767 1119.0869 1126.2575 1133.0384 1145.3413 1162.1565 1172.4599 1197.2097 1210.4523 1231.8378 1262.3137 1285.0645 1288.4894 1293.8316 1306.4337 1316.4355 1328.3819 1340.9517 1360.3622 1368.5833 1374.7531 1397.1310 1423.1083 1427.0373 1446.1141 1452.3352 1460.0430 1470.2832 1472.3022 1480.1164 1497.6616 1521.5525 1528.3286 1561.5432 1563.2708 1589.5841 1606.2687 1628.2773 1632.9308 2964.8160 3036.0632 3106.5126 3126.1785 3151.0195 3151.1748 3153.2861 3154.5593 3160.1179 3161.8034 3164.9639 3165.3750 3172.2047 3174.2954 3187.3437 3480.0230 3480.3462 3571.2866
redmass: 8.0743 6.7721 4.3521 7.7854 8.3435 11.1031 7.6934 9.0567 6.1443 9.0921 5.8678 7.2680 5.8653 4.5102 5.6230 7.0446 5.4451 6.4115 1.7307 1.7640 4.1357 2.7553 2.9411 3.3912 2.5287 4.1537 3.8392 3.4172 7.2060 4.2817 6.2003 3.7234 4.9009 4.4165 6.7583 8.9152 9.5022 6.5554 7.8996 4.2172 4.0971 10.8335 8.9141 8.5396 3.5656 3.1055 5.4331 1.3249 4.6083 7.4419 4.7915 2.7972 4.9786 6.2426 7.6612 8.4697 5.1802 6.8160 4.4456 7.0762 6.8788 8.0671 8.8820 6.5664 3.3806 3.9025 3.8951 5.1903 6.8608 1.2691 6.3155 10.9533 9.9248 1.6939 1.5407 6.7189 1.4834 3.8658 2.7143 6.3935 1.3704 1.4467 2.3489 2.3935 5.0434 1.3521 2.7633 1.3474 1.4792 2.2769 2.1255 1.7021 1.2030 1.2187 2.6548 2.8334 1.4729 1.2827 1.4773 1.5390 2.2170 1.5522 1.3715 4.3195 2.8344 2.1243 2.1279 1.7439 1.6137 1.5436 2.3289 4.3470 2.6092 2.4857 2.1316 3.2922 3.5496 2.6040 5.9228 3.9411 1.3424 3.0619 2.3191 1.0469 3.2437 2.4600 1.1712 3.4231 4.8321 7.3664 3.7872 6.2256 7.5012 6.3787 4.6323 1.0370 1.1014 1.0973 1.0892 1.0925 1.0874 1.0901 1.0902 1.0901 1.0919 1.0955 1.0863 1.0967 1.0965 1.0958 1.0662 1.0662 1.0774
irintensity: 0.5580 0.2452 0.2203 0.5052 2.0046 0.3387 0.9120 2.0108 5.2552 1.3448 0.6688 0.5893 0.0346 0.7985 1.0825 0.9763 2.0085 6.1983 5.7524 11.0274 7.3153 25.3629 31.3968 1.9184 2.7630 2.9624 10.5074 19.6070 10.2576 9.8753 4.9418 113.1505 18.7050 0.0222 4.8787 25.6503 14.7863 1.6325 1.4962 5.0872 9.2424 97.5579 7.9635 22.5792 2.1834 12.6000 2.0259 95.9561 19.7173 7.9258 3.5896 9.5147 55.4828 29.4582 166.1569 91.8850 10.5572 15.1950 3.6225 1.3305 3.2358 8.4911 10.4855 10.6506 1.2131 0.8338 4.5664 3.9166 22.4267 5.0234 35.1405 78.8809 14.8352 53.5933 16.8283 22.5259 58.8399 23.6718 4.2821 0.7936 35.5693 29.6006 9.6454 59.4571 106.7471 2.1056 3.7888 0.7104 4.1152 50.4933 10.2936 5.3489 70.5224 82.0050 15.9170 97.7933 8.8658 1.4551 11.9745 130.4194 803.1417 8.1814 115.2455 988.1123 739.3222 223.4380 32.4035 1.7201 0.9810 82.6120 24.0572 944.4608 587.7865 6.8927 58.0926 231.8457 74.4382 51.1049 20.9245 120.4024 6.1107 0.5284 0.2160 16.2458 131.9248 0.4388 33.0163 212.1603 21.4320 3.8406 179.1272 1081.8545 32.0147 1029.8473 36.7619 193.0282 36.1510 29.1986 27.6768 2.7922 8.5268 1.0767 14.7054 0.7085 37.2708 12.6833 9.2200 25.7211 5.0928 2.4707 44.1891 48.0567 271.3308
temp: 298.150 k
press: 1.00000 atm
elementType: 16 16 8 8 8 8 8 8 8 8 7 7 7 7 6 6 6 6 6 6 6 6 6 6 6 6 6 6 6 6 6 6 6 6 6 1 1 1 1 1 1 1 1 1 1 1 1 1 1 1 1 1 1
symmnumber: 1
zpe: 953742.1 jmol-1
zpe.correction: 0.363261 hartree
zpe.thermalcorrener: 0.398450 hartree
zpe.thermalcorrenthalpy: 0.399394 hartree
zpe.thermalcorrgfe: 0.291359 hartree
zpe.sumelectzpe: -2424.963165 hartree
zpe.sumelectthermal: -2424.927976 hartree
zpe.sumelectthermalent: -2424.927032 hartree
zpe.sumelectthermalfe: -2425.035067 hartree
dipole: 17.4046 -2.3782 -0.2127
dipole: 17.5677
quadrupole: -151.1836 -217.4745 -227.2937
quadrupole: -22.5028 2.9281 17.8123
quadrupole: 47.4670 -18.8239 -28.6431 -22.5028 2.9281 17.8123
hfenergy: -2425.3264262 hartree
pointgroup: C01 [X(C21H18N4O8S2)]
dipole: 6.8823165 -0.6360139 0.011121 debye
polarizability: 1407.3091554|-19.8674365|361.8817389|23.8433927|11.7659966|166.5119283 unknown
InChI: InChI=1S/C21H18N4O8S2/c1-22-16-7-9-17(10-8-16)23-24-18-6-4-14(20(12-18)34(28,29)30)2-3-15-5-11-19(25(26)27)13-21(15)35(31,32)33/h2-13,22,28,31H,1H3
charge 0 multiplicity 1
53 atoms
S  -4.638028 -3.063557 -0.137767
S  0.120322 3.06328 0.220345
O  -4.019265 -3.079568 -1.895239
O  -0.530378 3.017434 1.969511
O  -3.378587 -3.379195 0.828656
O  -5.973583 -3.96647 -0.025065
O  1.414974 4.028988 0.15314
O  -1.14179 3.369097 -0.751099
O  -8.77149 1.825808 -0.098345
O  -9.203367 -0.418289 -0.154202
N  -8.396093 0.58937 -0.127343
N  3.947584 -0.5852 0.12006
N  4.742549 0.469238 0.150859
N  10.335259 -0.245695 0.174267
C  -4.132152 -0.209471 -0.134629
C  -0.293134 0.191341 0.132768
C  -5.121697 -1.235944 -0.153118
C  0.673109 1.239469 0.18745
C  -2.696371 -0.487157 -0.159911
C  -1.73343 0.439592 0.155817
C  -6.502726 -1.02296 -0.15495
C  2.051599 1.073627 0.187334
C  -4.651685 1.127019 -0.124001
C  0.264354 -1.125809 0.082905
C  -6.942949 0.314495 -0.128646
C  2.565187 -0.257052 0.12554
C  -6.026748 1.392301 -0.117707
C  1.648724 -1.344313 0.078376
C  6.121018 0.194539 0.153582
C  8.958143 -0.115619 0.166889
C  6.978866 1.336877 0.18262
C  6.708835 -1.109861 0.130711
C  8.366883 1.19095 0.189208
C  8.0965 -1.264821 0.137122
C  11.048504 -1.524603 0.155013
H  -2.397839 -1.496963 -0.455137
H  -2.043501 1.443796 0.459788
H  -7.219142 -1.850878 -0.165591
H  2.746013 1.919554 0.223301
H  -3.94991 1.965067 -0.161308
H  -0.412484 -1.985426 0.084911
H  -6.4108 2.415612 -0.116958
H  2.057837 -2.358741 0.049264
H  -3.821585 -4.030255 -2.140734
H  -0.753781 3.95736 2.233488
H  6.513364 2.327623 0.199537
H  6.044685 -1.979424 0.108307
H  9.01383 2.076291 0.211403
H  8.528846 -2.269728 0.119486
H  10.888964 0.610332 0.196972
H  10.798108 -2.145473 1.037067
H  12.133166 -1.333055 0.1705
H  10.816894 -2.108134 -0.757149
