program: Gaussian 09
title: 000170614
version: EM64L-G09RevD.01
frameworkgroup: C1[X(C10H14N2O2)]
method: RPBEPBE
basis: SDD
operation: Freq
keyword: #p
keyword: freq=noraman
keyword: PBEPBE/SDD
title: #p freq=noraman PBEPBE/SDD
converged: NO YES NO NO
title: Mulliken charges:
elementType: O O N N C C C C C C C C C C H H H H H H H H H H H H H H
charge: -0.181763 -0.180818 0.035603 0.040959 0.402185 -0.470866 -0.471414 -0.411247 -0.424717 -0.385795 -0.517032 -0.506446 -0.001646 -0.003112 0.193430 0.228315 0.225521 0.202222 0.206205 0.205182 0.202461 0.208365 0.209898 0.189852 0.261928 0.246600 0.257514 0.238617
chargesum: 0.00000
title: Mulliken charges with hydrogens summed into heavy atoms:
elementType: O O N N C C C C C C C C C C
charge: -0.181763 -0.180818 0.035603 0.040959 0.402185 -0.049121 -0.043671 0.000139 -0.013891 0.013955 -0.008504 -0.010316 -0.001646 -0.003112
polarizability: 1.41698784e+02 1.41929922e+00 1.35764956e+02 4.17955874e+00 3.38311196e+00 9.09728327e+01
1716.lowfreq: -14.3361 -11.2957 -7.9098 0.0001 0.0005 0.0007 20.0077 33.3147 68.1634
frequency: 19.9684 33.1546 68.0975 72.7851 107.7622 117.3216 149.6574 176.9514 230.4639 255.0466 271.3833 298.3019 325.4489 365.1429 433.7426 473.9035 479.7765 503.7797 505.1211 542.1578 543.3093 571.4901 730.3006 776.1198 813.2378 825.0585 843.1505 854.2072 883.3597 904.0515 929.9982 938.5942 970.7377 1011.9194 1052.8948 1085.4184 1103.0720 1116.1290 1135.5073 1173.3587 1204.0148 1239.7755 1245.5455 1265.7328 1272.8253 1307.5613 1323.1212 1333.2362 1338.9435 1344.1074 1351.2665 1356.5942 1358.3599 1402.2532 1405.4524 1453.8452 1458.5351 1460.5894 1461.2457 1469.3445 1474.0172 1481.5709 2305.9865 2318.5832 2960.5890 2966.1502 2967.2396 2970.1483 2971.1627 2975.3543 2982.3987 3024.9535 3027.0463 3031.3916 3032.1695 3034.9068 3039.8770 3046.4912
redmass: 11.9220 6.6264 5.9935 5.1761 4.8094 6.1954 2.6767 3.9474 2.8439 3.4809 3.1187 2.2004 2.1570 2.0904 2.6452 2.1785 2.9346 11.5029 11.7797 10.7634 11.3395 2.1275 3.3975 1.4943 2.4872 3.5341 1.7168 3.6997 2.4572 2.1485 1.4881 2.2117 2.0935 1.7541 1.9305 1.2894 1.6291 2.2062 1.7407 1.9232 1.7997 1.2898 1.1752 1.2714 1.1881 1.4886 1.3620 1.3733 1.5021 1.4534 1.3960 1.4053 1.4956 10.1841 9.9522 1.0852 1.0913 1.0927 1.0815 1.0848 1.0867 1.0872 12.2660 12.3574 1.0623 1.0614 1.0650 1.0602 1.0617 1.0622 1.0584 1.1017 1.0963 1.1005 1.0948 1.1012 1.1029 1.1031
irintensity: 0.8490 0.0688 1.5147 0.8732 2.0571 2.3689 1.2097 3.0657 17.2952 17.9803 2.5831 8.7986 1.8045 0.2209 0.7427 0.9638 5.5663 10.8481 16.8235 19.0165 18.6407 12.4602 9.5881 1.3318 2.2014 11.7867 10.7117 4.9657 22.7688 25.6791 9.4131 5.0049 6.2285 5.0990 2.0234 0.0793 0.8024 3.3864 1.7566 1.0353 1.7887 10.1082 2.3292 1.0875 3.1767 11.8667 1.1889 0.2076 3.5026 8.2654 35.0414 15.4581 3.5597 0.5885 2.1709 10.6667 4.8559 16.4767 13.5584 14.6637 47.8203 16.7504 1167.1446 873.9133 10.6110 35.9415 22.6102 36.2656 36.5110 31.3670 24.3651 4.1705 74.2659 43.0451 55.2063 10.7612 24.0547 111.4923
temp: 298.150 k
press: 1.00000 atm
elementType: 8 8 7 7 6 6 6 6 6 6 6 6 6 6 1 1 1 1 1 1 1 1 1 1 1 1 1 1
symmnumber: 1
zpe: 600251.8 jmol-1
zpe.correction: 0.228624 hartree
zpe.thermalcorrener: 0.242943 hartree
zpe.thermalcorrenthalpy: 0.243887 hartree
zpe.thermalcorrgfe: 0.185394 hartree
zpe.sumelectzpe: -648.347648 hartree
zpe.sumelectthermal: -648.333329 hartree
zpe.sumelectthermalent: -648.332384 hartree
zpe.sumelectthermalfe: -648.390878 hartree
dipole: 4.4136 -2.4728 0.5729
dipole: 5.0915
quadrupole: -97.7929 -101.5062 -78.3685
quadrupole: -3.8612 -2.8382 -2.1331
quadrupole: -5.2370 -8.9503 14.1873 -3.8612 -2.8382 -2.1331
hfenergy: -648.5762718 hartree
pointgroup: C01 [X(C10H14N2O2)]
dipole: -1.7528003 -0.9545537 -0.1704982 debye
polarizability: 141.0782638|-0.4230153|133.7826651|6.6915517|-10.034725|93.5756443 unknown
InChI: InChI=1S/C10H14N2O2/c13-8-11-6-10(7-12-9-14)4-2-1-3-5-10/h1-7H2
charge 0 multiplicity 1
28 atoms
O  0.832099 4.299448 -0.412059
O  4.197181 -1.876013 0.691611
N  0.268452 1.948321 -0.118242
N  1.952889 -1.136347 0.101478
C  -0.423214 -0.441184 -0.188242
C  -1.460111 -0.159639 -1.313391
C  -0.925276 -1.600073 0.72221
C  -2.895477 0.056542 -0.778039
C  -2.367847 -1.400504 1.248705
C  -3.359361 -1.135418 0.090702
C  -0.17521 0.82286 0.685039
C  0.914495 -0.842295 -0.870763
C  0.53501 3.134698 -0.193952
C  3.089424 -1.514851 0.324817
H  -1.469019 -1.028135 -2.005173
H  -1.136719 0.719409 -1.903596
H  -0.22051 -1.743669 1.564099
H  -0.895914 -2.535763 0.126248
H  -3.585276 0.19894 -1.631626
H  -2.943243 0.990492 -0.181948
H  -2.405718 -0.556228 1.966593
H  -2.674065 -2.300171 1.816152
H  -4.374102 -0.947727 0.490756
H  -3.42712 -2.043231 -0.544175
H  0.600997 0.580736 1.437103
H  -1.09827 1.099691 1.226689
H  1.248896 -0.012237 -1.52396
H  0.739709 -1.732352 -1.507638
