program: Gaussian 09
title: 000170641
version: EM64L-G09RevD.01
frameworkgroup: C1[X(C13H12N2O5S)]
method: RPBEPBE
basis: SDD
operation: Freq
keyword: #p
keyword: freq=noraman
keyword: PBEPBE/SDD
title: #p freq=noraman PBEPBE/SDD
converged: YES YES NO NO
title: Mulliken charges:
elementType: S O O O O O N N C C C C C C C C C C C C C H H H H H H H H H H H H
charge: 0.975001 -0.384275 -0.494342 -0.515436 -0.284907 -0.212568 -0.011249 0.036363 0.512107 -0.235768 0.232531 -0.236201 -0.348251 -0.378577 -0.161394 -0.250134 -0.400946 0.230610 -0.313224 -0.208884 -0.491061 0.302819 0.293608 0.294682 0.252317 0.225961 0.264792 0.258131 0.191388 0.205737 0.234260 0.208582 0.208328
chargesum: 0.00000
title: Mulliken charges with hydrogens summed into heavy atoms:
elementType: S O O O O O N N C C C C C C C C C C C C C
charge: 0.975001 -0.384275 -0.494342 -0.515436 -0.284907 -0.212568 -0.011249 0.036363 0.512107 -0.235768 0.232531 0.066619 -0.054643 -0.083896 -0.161394 0.002183 -0.142815 0.230610 0.177529 0.188241 0.160108
polarizability: 3.10306592e+02 6.10773556e+00 1.90018931e+02 -3.61023412e+01 -3.20512357e+01 1.54779443e+02
1716.lowfreq: -10.5079 -4.6408 -0.0012 -0.0008 0.0010 4.6682 15.1939 33.4161 40.1168
frequency: 14.3624 33.2258 40.0944 53.5748 70.0607 84.4476 95.1025 98.5546 123.9714 145.4922 173.3928 200.0558 207.5539 216.4123 225.7604 231.1126 259.7575 262.8739 276.1367 324.4869 347.2388 383.8325 394.7881 427.4159 435.8078 444.0720 457.2824 488.6288 495.2939 522.5809 538.3102 560.6789 575.2382 628.7519 680.3374 685.4011 746.2885 777.4671 789.7218 800.3388 824.8623 838.3004 844.9418 853.4220 934.6901 951.4301 959.8555 963.0968 972.2527 1001.6286 1008.9665 1062.8647 1068.0582 1089.8392 1100.8437 1118.3202 1150.7205 1155.2553 1192.4713 1203.1335 1233.3117 1254.2073 1255.8058 1270.0980 1292.4863 1346.2804 1370.3577 1378.8407 1399.8169 1432.1216 1434.3931 1435.7091 1457.0029 1458.5999 1467.2172 1477.8730 1526.8045 1542.1619 1604.9671 1607.6813 2037.4023 2920.8641 2933.8027 2975.4574 2988.9735 3009.1240 3056.3622 3105.0493 3151.1009 3157.5709 3164.1735 3176.7273 3183.6032
redmass: 5.7836 4.6731 4.4695 5.3351 6.7216 6.1438 5.2152 3.5526 3.8659 9.7949 7.0829 2.5683 3.5554 4.2493 4.2115 7.3284 3.8167 5.9140 2.8719 5.9541 4.1240 7.5435 7.9625 6.1499 10.8460 4.5771 5.8626 6.2592 6.2535 3.8756 5.3928 6.8668 3.8813 7.0632 7.3855 3.3893 7.2630 1.8199 2.7888 1.5667 11.4265 3.5340 3.0910 5.3834 7.4450 1.7314 1.5485 3.1064 2.6694 2.7265 1.3722 2.8151 2.1061 3.3721 2.5413 1.4019 1.5229 1.4135 1.3884 1.1121 2.5639 1.5733 1.2785 4.3251 2.3847 1.2304 1.3850 7.0589 2.1164 2.3698 1.1517 1.0960 1.0625 1.0693 3.3894 1.0637 6.9205 9.1249 6.6837 7.6708 13.8652 1.0548 1.0364 1.0800 1.0821 1.1033 1.1024 1.0976 1.0873 1.0891 1.0922 1.0994 1.0976
irintensity: 0.4443 0.7465 1.1819 0.4443 0.5327 8.5547 1.7203 7.1557 3.1058 4.5167 0.6402 2.8295 1.5899 2.2943 2.2074 5.1607 0.4996 1.8304 6.2164 13.3496 8.8459 12.6895 12.3739 35.5205 10.6069 0.6553 69.8775 9.2866 37.3221 17.4070 43.1670 15.2709 0.6210 15.5539 1.4483 1.6201 6.5863 11.1397 18.9583 64.6947 118.0292 35.3033 1.4765 1.8718 31.1419 24.3234 6.2730 53.6385 7.6466 55.1393 1.6802 45.9267 10.0715 0.3494 18.4076 2.0298 6.2905 7.3945 5.4362 11.0067 8.6475 10.3597 5.3725 118.8024 4.2555 21.0656 6.7096 14.1075 49.9522 27.9973 4.3840 20.1555 19.7096 9.0277 13.5358 8.6496 47.8788 136.8424 183.4653 25.1337 727.8338 54.4337 92.7206 16.4454 63.7917 62.6918 12.2589 21.2631 2.3013 5.3754 8.8050 6.2335 5.5737
temp: 298.150 k
press: 1.00000 atm
elementType: 16 8 8 8 8 8 7 7 6 6 6 6 6 6 6 6 6 6 6 6 6 1 1 1 1 1 1 1 1 1 1 1 1
symmnumber: 1
zpe: 608401.6 jmol-1
zpe.correction: 0.231728 hartree
zpe.thermalcorrener: 0.252433 hartree
zpe.thermalcorrenthalpy: 0.253378 hartree
zpe.thermalcorrgfe: 0.180240 hartree
zpe.sumelectzpe: -1384.502181 hartree
zpe.sumelectthermal: -1384.481475 hartree
zpe.sumelectthermalent: -1384.480531 hartree
zpe.sumelectthermalfe: -1384.553669 hartree
dipole: 0.4215 2.9645 3.7076
dipole: 4.7658
quadrupole: -139.8007 -129.2199 -122.4656
quadrupole: 20.3485 8.4783 -6.6973
quadrupole: -9.3053 1.2755 8.0298 20.3485 8.4783 -6.6973
hfenergy: -1384.7339087 hartree
pointgroup: C01 [X(C13H12N2O5S1)]
dipole: 0.5862563 1.3962793 -1.1055807 debye
polarizability: 291.5796885|-64.0217283|171.7344458|16.2514177|23.1197232|191.7908312 unknown
InChI: InChI=1S/C13H12N2O5S/c1-19-7-8-20-21(17,18)12-4-2-3-10-9(12)5-6-11(15-14)13(10)16/h2-6H,7-8H2,1H3
charge 0 multiplicity 1
33 atoms
S  1.966615 -1.013013 1.80174
O  2.619249 0.766617 1.827958
O  1.156096 -1.132847 3.193629
O  3.203134 -2.010885 1.470294
O  3.381016 0.580358 -1.072453
O  -3.28624 0.275177 -1.97917
N  -4.047562 1.82534 0.176344
N  -5.08282 2.327831 -0.062987
C  -0.429248 -0.278509 0.355887
C  0.784194 -1.020833 0.323666
C  -1.245956 -0.384441 -0.828158
C  1.213692 -1.800687 -0.753311
C  -0.853604 0.551527 1.471005
C  -0.83684 -1.187061 -1.925465
C  -2.53966 0.34112 -0.94944
C  0.378045 -1.891244 -1.89504
C  -2.040682 1.246672 1.417921
C  -2.886318 1.161341 0.249519
C  3.965629 0.918626 1.241669
C  3.894232 1.576412 -0.131247
C  3.107255 1.144842 -2.393347
H  2.176469 -2.317702 -0.699953
H  -0.232685 0.609142 2.367619
H  -1.502285 -1.234585 -2.793213
H  0.685968 -2.508196 -2.744427
H  4.526163 1.549309 1.956377
H  4.462479 -0.070474 1.170734
H  -2.362183 1.869022 2.258617
H  4.911939 1.913725 -0.435205
H  3.224406 2.463094 -0.095883
H  2.698228 0.322499 -3.000959
H  4.033063 1.53019 -2.870516
H  2.361411 1.965534 -2.337104
