program: Gaussian 09
title: 000170609
version: EM64L-G09RevD.01
frameworkgroup: C1[X(C10H20O3)]
method: RPBEPBE
basis: SDD
operation: Freq
keyword: #pfreq=noraman
keyword: PBEPBE/SDD
title: #p freq=noraman PBEPBE/SDD
converged: YES YES NO NO
title: Mulliken charges:
elementType: O O O C C C C C C C C C C H H H H H H H H H H H H H H H H H H H H
charge: -0.291853 -0.229836 -0.441733 -0.371492 -0.365497 -0.351728 -0.374963 -0.355697 -0.520394 -0.695794 0.248699 -0.258777 -0.323397 0.192146 0.192535 0.190258 0.188744 0.187714 0.187027 0.214196 0.220406 0.195890 0.195502 0.246372 0.245016 0.209553 0.209698 0.216212 0.224735 0.245743 0.202818 0.217323 0.350574
chargesum: 0.00000
title: Mulliken charges with hydrogens summed into heavy atoms:
elementType: O O O C C C C C C C C C C
charge: -0.291853 -0.229836 -0.091160 0.013189 0.013505 0.023014 0.059639 0.035694 -0.029006 -0.060331 0.248699 0.211701 0.096743
polarizability: 1.59882228e+02 2.69900479e-01 1.07729138e+02 1.14552234e+00 -1.06261637e+00 9.29093998e+01
1716.lowfreq: -6.0040 -3.2914 -0.0006 0.0003 0.0008 3.8329 23.7046 29.9709 39.7522
frequency: 21.1199 29.1262 39.7265 41.5522 62.2152 74.9477 88.8263 114.6149 130.4151 138.4656 160.3990 199.8761 214.2501 221.9489 282.2860 295.1057 387.4159 412.4402 424.8598 465.3837 501.2521 546.3663 680.0345 722.6089 728.9361 760.5670 797.7907 825.4038 860.3993 889.4348 907.3642 912.0093 965.7873 995.0245 1001.9606 1030.2235 1048.9861 1057.7713 1080.0266 1083.6109 1084.7204 1105.1032 1114.5137 1128.6715 1187.4550 1188.8156 1211.5526 1224.9691 1229.4026 1267.6346 1271.8534 1282.0503 1293.0807 1293.5947 1313.4371 1328.8524 1344.0626 1354.2169 1357.9898 1366.8443 1383.9563 1390.3851 1438.1677 1451.3373 1460.1469 1462.5538 1463.4803 1468.9771 1475.6605 1476.4422 1483.4986 1488.8519 1649.9944 2950.5229 2951.8763 2960.0383 2969.1975 2971.9453 2974.0562 2982.5833 2985.9949 2994.5666 2995.9765 3014.9925 3015.3154 3028.9086 3036.2706 3061.5904 3068.1955 3070.7492 3080.5781 3089.2639 3556.6018
redmass: 2.4651 2.7898 5.9013 4.5546 2.5967 1.8325 3.3918 3.1523 1.9257 2.1660 3.4807 3.9176 3.9349 1.1463 3.8340 2.5121 2.4391 2.8211 1.4578 2.7845 2.9425 2.6834 5.1971 1.0687 1.1059 1.1938 2.7779 1.2753 2.8795 1.8804 1.2980 5.0975 2.3101 1.1858 4.2950 3.1603 2.8744 3.2383 2.1226 1.8159 2.4030 2.2106 1.7248 3.0480 1.2093 1.6811 1.1984 1.3284 1.3729 1.2377 1.3400 1.0336 1.1053 1.1048 1.4083 1.2115 1.4291 1.4713 1.6501 1.6983 1.2756 1.2178 1.0855 1.0838 1.0856 1.0748 1.0690 1.0740 1.0628 1.0536 1.0843 1.0927 9.9656 1.0590 1.0589 1.0592 1.0581 1.0373 1.0680 1.0620 1.0967 1.0650 1.0945 1.1025 1.0577 1.0993 1.1036 1.1031 1.1007 1.0992 1.0961 1.1073 1.0656
irintensity: 0.3123 0.3636 1.5979 1.3654 0.8247 0.7776 1.1133 0.9110 0.2752 0.4908 2.6161 11.1232 2.0306 0.0478 6.1820 6.9087 31.4692 29.5004 136.1330 6.3721 3.8290 2.3281 3.5776 16.3968 0.0981 5.0383 7.7944 0.1118 17.5342 2.2206 4.2417 39.4725 56.9539 0.0309 17.7871 48.0055 40.4387 33.2266 16.2770 10.3055 6.8280 141.3852 19.2801 168.4547 8.9067 0.1840 16.3346 40.9650 3.9037 3.2244 25.3750 0.3172 0.3220 0.2208 24.0119 10.0627 10.2423 3.6679 0.3679 13.4891 24.0619 11.6144 24.2347 12.7850 5.4538 0.1029 0.2659 1.8340 5.1218 8.9860 3.9776 26.9926 164.9724 3.1054 3.3564 26.4882 112.3994 32.5017 56.8711 5.7302 1.4616 35.0168 6.3869 1.2772 16.9961 10.2210 61.1835 63.3435 107.5141 53.9163 28.4083 30.0550 6.0876
temp: 298.150 k
press: 1.00000 atm
elementType: 8 8 8 6 6 6 6 6 6 6 6 6 6 1 1 1 1 1 1 1 1 1 1 1 1 1 1 1 1 1 1 1 1
symmnumber: 1
zpe: 753659.5 jmol-1
zpe.correction: 0.287054 hartree
zpe.thermalcorrener: 0.303885 hartree
zpe.thermalcorrenthalpy: 0.304829 hartree
zpe.thermalcorrgfe: 0.239116 hartree
zpe.sumelectzpe: -617.650957 hartree
zpe.sumelectthermal: -617.634126 hartree
zpe.sumelectthermalent: -617.633182 hartree
zpe.sumelectthermalfe: -617.698895 hartree
dipole: -1.5006 -0.7476 1.3632
dipole: 2.1608
quadrupole: -88.8699 -87.8259 -79.9028
quadrupole: 6.3348 7.6488 0.5982
quadrupole: -3.3371 -2.2930 5.6301 6.3348 7.6488 0.5982
hfenergy: -617.9380105 hartree
pointgroup: C01 [X(C10H20O3)]
dipole: 0.5915453 0.324209 0.5173609 debye
polarizability: 159.8778076|0.1738905|107.8019885|-1.2861975|0.2027828|92.8409702 unknown
InChI: InChI=1S/C10H20O3/c1-2-3-4-5-6-7-10(12)13-9-8-11/h11H,2-9H2,1H3
charge 0 multiplicity 1
33 atoms
O  -3.101484 0.18337 0.20913
O  -1.968168 -1.831187 -0.068049
O  -5.49715 1.522336 -0.662905
C  3.180299 -0.351327 -0.127325
C  1.859706 0.405584 0.139341
C  4.439421 0.518972 0.083829
C  0.611819 -0.484451 -0.048376
C  5.758044 -0.241606 -0.185424
C  -0.698696 0.283878 0.210134
C  7.013666 0.628066 0.03956
C  -1.934687 -0.592042 0.093827
C  -4.39839 -0.557597 0.119325
C  -5.481058 0.486624 0.373442
H  3.233221 -1.238646 0.537629
H  3.174811 -0.74269 -1.166096
H  1.798834 1.283394 -0.538022
H  1.874142 0.810465 1.173381
H  4.389266 1.408612 -0.578742
H  4.448262 0.906993 1.124198
H  0.598247 -0.89956 -1.07475
H  0.665103 -1.355721 0.631809
H  5.75207 -0.622854 -1.227062
H  5.802764 -1.134523 0.471271
H  -0.694997 0.730056 1.225177
H  -0.8071 1.13549 -0.489008
H  7.058379 0.997486 1.081662
H  7.010507 1.51059 -0.628008
H  7.941346 0.059693 -0.15717
H  -4.407524 -1.369036 0.869838
H  -4.480059 -0.996713 -0.890485
H  -5.343582 0.930238 1.381734
H  -6.474472 0.009352 0.327619
H  -4.586444 1.911654 -0.710681
