program: Gaussian 09
title: 000170604
version: EM64L-G09RevD.01
frameworkgroup: C1[X(C5H7ClO2)]
method: RPBEPBE
basis: SDD
operation: Freq
keyword: #p
keyword: freq=noraman
keyword: PBEPBE/SDD
title: #p freq=noraman PBEPBE/SDD
converged: YES YES NO NO
title: Mulliken charges:
elementType: Cl O O C C C C C H H H H H H H
charge: -0.037144 -0.199226 -0.158564 0.531128 -0.434436 -0.786580 -0.697366 0.110463 0.254456 0.247709 0.220964 0.255542 0.231272 0.229039 0.232742
chargesum: 0.00000
title: Mulliken charges with hydrogens summed into heavy atoms:
elementType: Cl O O C C C C C
charge: -0.037144 -0.199226 -0.158564 0.531128 0.067730 -0.078801 -0.235585 0.110463
polarizability: 9.88854649e+01 -9.01933593e+00 6.42972489e+01 8.96288656e+00 -1.32080218e-01 5.25593808e+01
1716.lowfreq: -13.8423 -5.3693 -0.0013 -0.0008 -0.0007 4.3256 24.4208 49.9372 100.5515
frequency: 24.0738 49.9201 100.5421 153.6620 168.5643 236.7895 306.4310 388.5146 415.8977 433.0398 525.8403 614.2780 693.8266 749.5572 831.5548 849.0299 950.0840 968.4671 987.0257 1032.1706 1054.7592 1064.6879 1191.5779 1302.6706 1339.9222 1396.6760 1433.0871 1452.9934 1462.9239 1481.0093 1674.9978 1693.0212 2975.7877 3008.0023 3055.7170 3092.9805 3097.4416 3100.5892 3202.4668
redmass: 5.0789 3.4499 4.4054 1.8125 1.7455 5.1334 5.4733 2.1731 11.9917 2.4944 3.2779 11.9244 1.1450 8.3696 5.2381 3.4915 1.3842 1.3217 1.6662 1.5826 3.0499 2.3626 1.0861 2.0197 1.6865 1.2398 1.1648 1.0781 1.0680 1.0724 5.0726 11.8268 1.0386 1.0588 1.0954 1.1060 1.0651 1.0982 1.1143
irintensity: 1.2073 0.3227 0.4895 1.5732 1.5196 13.2637 9.3633 4.5290 6.5906 21.3494 6.7840 9.6610 0.8565 88.4186 61.6226 6.8049 14.3551 73.3358 22.5375 86.2461 317.1017 241.5609 5.2720 5.0405 17.8374 25.4123 5.2196 8.9930 24.5231 23.9562 15.2778 354.2755 17.8126 11.3966 15.7428 15.4067 8.9249 15.7043 17.2506
temp: 298.150 k
press: 1.00000 atm
elementType: 17 8 8 6 6 6 6 6 1 1 1 1 1 1 1
symmnumber: 1
zpe: 290456.8 jmol-1
zpe.correction: 0.110629 hartree
zpe.thermalcorrener: 0.119972 hartree
zpe.thermalcorrenthalpy: 0.120917 hartree
zpe.thermalcorrgfe: 0.074165 hartree
zpe.sumelectzpe: -804.589005 hartree
zpe.sumelectthermal: -804.579662 hartree
zpe.sumelectthermalent: -804.578717 hartree
zpe.sumelectthermalfe: -804.625469 hartree
dipole: -3.7881 -0.0252 0.1446
dipole: 3.7909
quadrupole: -55.0916 -55.5241 -53.8938
quadrupole: -1.9171 -0.7620 -3.6734
quadrupole: -0.2551 -0.6876 0.9427 -1.9171 -0.7620 -3.6734
hfenergy: -804.6996338 hartree
pointgroup: C01 [X(C5H7Cl1O2)]
dipole: 1.4798916 -0.1632319 0.088078 debye
dipolederiv: -0.6190786 0.3383698 -0.1411307 0.4598496 -0.5224997 0.2135855 -0.2102298 0.230134 -0.2066468 -1.9181119 0.2311967 0.1134789 0.0752175 -0.4097465 0.1169712 0.132516 0.0953384 -0.3132385 -0.7138665 -0.0233224 0.0837471 -0.1621061 -0.8248357 0.3994961 0.1748203 0.3828857 -0.5283636 -0.0139871 0.0742745 -0.0386211 0.0481401 0.1989688 0.2325385 -0.0385494 0.190475 0.0517741 1.0634346 -0.1912224 -0.0769114 -0.371262 0.2783716 -0.0350746 0.2380191 -0.0332455 0.2961485 -0.0255437 0.0097811 0.0206695 -0.0295018 -0.1276958 -0.0926261 0.0420526 -0.1051293 0.0113914 -0.1195932 0.1726482 -0.0268526 0.0925913 -0.1392479 0.1022074 -0.1169066 0.1080833 -0.2932238 2.3367565 -0.4219824 -0.0389708 -0.1113076 1.3754679 -0.7304596 -0.2719562 -0.6827699 0.7291177 -0.021765 0.0001513 -0.0221812 0.0269826 -0.0597641 -0.0581306 -0.0590013 -0.094047 0.0306254 -0.0522416 0.0132938 0.0763689 0.0893602 0.0709626 -0.0075747 -0.0067276 0.0397024 -0.071493 0.1195345 -0.032104 0.0399759 0.0042963 0.0593688 0.0379223 0.0323382 -0.0140198 -0.1467736 0.0434257 0.1008474 -0.05492 0.1064954 -0.0012638 -0.0039069 -0.0387793 0.0362895 0.0870752 -0.1166558 -0.112749 0.0222585 -0.0567317 0.0576812 -0.0180988 0.0616359 0.0050415 0.0911613 0.0905745 -0.0771277 -0.0004446 -0.0527965 -0.033328 -0.1275755 0.004061 -0.1124416 0.1138133 -0.0528822 -0.0820549 0.0435335 -0.1192272 0.0775607 -0.0292742 0.0567073 -0.0462967 0.1486324 unknown
polarizability: 96.2532997|-14.0327206|67.0705273|-6.792723|-0.8406889|52.4182676 unknown
InChI: InChI=1S/C5H7ClO2/c1-4(2)3-8-5(6)7/h1,3H2,2H3
charge 0 multiplicity 1
15 atoms
Cl -2.911018 1.233108 -0.547007
O  -0.507862 0.236577 -0.279634
O  -2.164424 -1.019373 0.811089
C  1.903035 -0.058282 -0.024709
C  0.573807 -0.733745 0.194904
C  2.121375 1.253978 0.699946
C  2.840288 -0.652986 -0.808845
C  -1.774379 -0.072054 0.125467
H  0.460136 -1.661359 -0.390145
H  0.36865 -0.939076 1.262469
H  1.997254 1.132291 1.793986
H  1.376609 2.002986 0.373362
H  3.128986 1.658034 0.508665
H  2.64384 -1.594884 -1.334535
H  3.834602 -0.213316 -0.943214
