program: Gaussian 09
title: 000170606
version: EM64L-G09RevD.01
frameworkgroup: C1[X(C4H10NO3PS)]
method: RPBEPBE
basis: SDD
operation: Freq
keyword: #p
keyword: freq=noraman
keyword: PBEPBE/SDD
title: #p freq=noraman PBEPBE/SDD
converged: YES YES NO NO
title: Mulliken charges:
elementType: S P O O O N C C C C H H H H H H H H H H
charge: -0.252367 0.916474 -0.465580 -0.456792 -0.210879 -0.698154 0.323121 -0.769870 -0.475224 -0.479462 0.364599 0.267450 0.227564 0.254933 0.252622 0.246111 0.233588 0.244864 0.230971 0.246030
chargesum: 0.00000
title: Mulliken charges with hydrogens summed into heavy atoms:
elementType: S P O O O N C C C C
charge: -0.252367 0.916474 -0.465580 -0.456792 -0.210879 -0.333555 0.323121 -0.019922 0.257097 0.242403
polarizability: 1.15613951e+02 -9.47954186e+00 9.75056919e+01 -7.60513985e+00 1.11482307e+01 9.25052220e+01
1716.lowfreq: -16.3560 -8.1981 -0.0028 -0.0023 -0.0011 7.7533 34.3491 52.3971 62.0021
frequency: 33.5112 52.3605 61.9528 69.7224 81.2503 90.4506 110.7845 120.3316 144.5108 182.1877 215.6710 241.3885 287.3440 314.6147 380.2782 412.8260 486.1290 567.1623 580.7722 606.6361 656.4771 700.3377 798.1540 920.7047 963.3900 972.8250 981.3472 1035.2672 1114.3779 1115.2015 1129.4748 1134.0192 1192.2870 1368.4779 1379.7024 1422.7799 1423.1461 1452.3358 1456.0312 1457.9376 1466.1902 1468.6597 1471.3051 1657.2274 2979.6511 2986.8744 2994.2521 3080.9442 3083.5140 3095.1170 3128.3856 3132.5323 3137.4671 3520.7415
redmass: 3.2274 1.3873 2.6777 2.3412 4.3745 1.7002 1.9628 1.1119 4.0488 6.1221 6.6467 5.6614 6.3191 4.0992 5.4491 5.5321 6.7912 1.7780 1.6965 5.7953 9.3114 8.8372 6.0435 6.6352 9.4583 3.5456 2.5531 1.6811 1.2435 1.2451 1.3014 1.3000 2.3932 1.5439 1.2235 1.1211 1.1185 1.0658 1.0515 1.0502 1.0501 1.0524 1.0524 8.0118 1.0301 1.0310 1.0372 1.1051 1.0984 1.1033 1.1024 1.0992 1.1040 1.0771
irintensity: 2.5849 4.6030 9.2548 4.2509 1.9194 1.4798 1.2234 0.2610 10.0042 4.6132 6.0480 3.4712 13.9551 6.5640 3.2211 22.9733 38.9868 42.0580 15.1096 15.3840 127.2562 145.6048 59.3153 63.0681 204.7092 158.7072 34.5772 15.5384 0.5723 0.4420 0.9045 0.6785 152.9980 369.8606 53.1302 1.7726 3.3672 9.7527 13.2293 12.5819 18.7047 17.2075 17.3570 197.0383 48.1374 42.9230 5.5316 25.7621 13.1927 20.3012 11.5826 7.9426 11.8619 30.9423
temp: 298.150 k
press: 1.00000 atm
elementType: 16 15 8 8 8 7 6 6 6 6 1 1 1 1 1 1 1 1 1 1
symmnumber: 1
zpe: 388290.0 jmol-1
zpe.correction: 0.147892 hartree
zpe.thermalcorrener: 0.162149 hartree
zpe.thermalcorrenthalpy: 0.163094 hartree
zpe.thermalcorrgfe: 0.104780 hartree
zpe.sumelectzpe: -1177.315451 hartree
zpe.sumelectthermal: -1177.301193 hartree
zpe.sumelectthermalent: -1177.300249 hartree
zpe.sumelectthermalfe: -1177.358563 hartree
dipole: -0.5995 -1.5816 -0.1062
dipole: 1.6948
quadrupole: -70.1997 -71.6770 -74.7408
quadrupole: 12.3715 11.4342 -5.5261
quadrupole: 2.0061 0.5288 -2.5349 12.3715 11.4342 -5.5261
hfenergy: -1177.4633425 hartree
pointgroup: C01 [X(C4H10N1O3P1S1)]
dipole: -0.2545401 -0.4385063 -0.4330235 debye
dipolederiv: -0.6110313 0.0325855 0.1505934 0.0171168 -0.4579752 -0.0657964 0.1652671 -0.0153443 -0.6587325 2.1600398 -0.1638436 -0.3952506 0.1666891 1.7568406 0.2250792 0.1459564 -0.1614163 1.7071979 -0.7734866 -0.2010487 -0.1489654 -0.3034375 -0.8995335 -0.3594897 -0.2793147 -0.3347678 -0.7929137 -0.5859711 0.1649563 0.015839 0.1285709 -1.198153 0.2254561 -0.0859032 0.3288666 -0.6611021 -0.5958333 0.0109311 -0.0297478 0.0271005 -0.3017774 -0.0245811 0.3901612 -0.0266558 -0.8942091 -1.8642598 0.0653876 0.3951875 0.0511262 -0.6380449 -0.0340187 0.4723048 -0.0018939 -0.7339531 1.6623674 -0.0461983 -0.1693927 -0.1046434 0.2391289 0.0330009 -0.8788368 0.0395605 1.2773181 -0.4105839 0.0115766 -0.147847 0.0632777 0.0437062 0.0552296 -0.1399188 0.0306695 -0.1276414 0.4607561 0.3896588 0.3113887 0.0613981 0.3148999 0.0902502 0.1238943 0.1653735 0.4156443 0.2598464 -0.1076319 0.0791941 -0.0876355 0.7243108 -0.2109615 -0.031533 0.1385034 0.1353616 0.127327 -0.0012013 -0.004945 0.0073949 0.3031614 -0.0152135 0.0452547 -0.012087 0.1351235 -0.033367 -0.0329285 0.0518429 -0.0537431 0.1207023 0.0162156 0.0853267 0.0340872 0.0351786 0.0815842 0.0480387 0.0306053 -0.013406 0.0253625 -0.1216613 -0.0094336 -0.1126397 -0.0223586 0.0815515 -0.0115467 -0.0194654 0.0239146 -0.0507587 0.06625 -0.0295976 0.0579638 0.085548 0.0363698 -0.0474052 -0.066751 0.0275183 0.0300074 0.1223338 -0.0694806 0.046654 -0.0432521 0.0609692 0.0139826 -0.0201645 0.0082483 -0.0805988 -0.0919743 -0.0300073 -0.093912 0.0728723 -0.0856852 -0.0886411 0.0155449 0.0044726 0.1120041 -0.0043447 0.1119306 0.013314 -0.0116137 -0.0199813 0.0408093 0.0656523 -0.0168661 0.0386302 0.0284874 0.1344734 -0.0885863 0.0553475 -0.0545499 -0.1083336 -0.0600601 -0.0507995 -0.0828228 -0.000546 -0.0516128 -0.0897332 0.0771797 0.1039381 0.0308523 -0.0532586 0.043703 0.0009097 0.0662843 -0.0689309 0.0820439 -0.0509953 unknown
polarizability: 114.6965962|-2.1366899|84.2973372|-12.2767211|4.0654097|106.6309319 unknown
InChI: InChI=1S/C4H10NO3PS/c1-4(6)5-9(10,7-2)8-3/h5H,1-3H3
charge 0 multiplicity 1
20 atoms
S  1.780663 -0.057553 -2.246553
P  0.512949 0.215661 -0.630829
O  0.475756 1.722977 0.188943
O  0.768726 -0.837058 0.722813
O  -2.264303 0.211809 0.952953
N  -1.167849 0.090723 -1.120692
C  -2.320469 0.149436 -0.296926
C  -3.623679 0.14408 -1.09523
C  1.694948 2.15058 0.915814
C  1.197874 -2.229233 0.465723
H  -1.298742 0.032622 -2.135666
H  -4.451113 -0.117606 -0.419356
H  -3.598904 -0.570601 -1.936907
H  -3.814172 1.153399 -1.504586
H  1.89776 1.464178 1.754598
H  1.450654 3.155518 1.289035
H  2.561411 2.19684 0.230199
H  2.035921 -2.257829 -0.254808
H  0.351198 -2.83018 0.088358
H  1.518472 -2.605061 1.448517
