program: Gaussian 09
title: 000170612
version: EM64L-G09RevD.01
frameworkgroup: C1[X(C9H14N2O5)]
method: RPBEPBE
basis: SDD
operation: Freq
keyword: #p
keyword: freq=noraman
keyword: PBEPBE/SDD
title: #p freq=noraman PBEPBE/SDD
converged: YES YES NO NO
title: Mulliken charges:
elementType: O O O O O N N C C C C C C C C C H H H H H H H H H H H H H H
charge: -0.288625 -0.413744 -0.226662 -0.403179 -0.265246 -0.161251 -0.561299 -0.141399 -0.477072 -0.467494 -0.402791 0.205671 -0.241281 0.198400 -0.496386 0.211660 0.305281 0.234988 0.247269 0.251096 0.232250 0.303785 0.217722 0.262524 0.277264 0.282300 0.289429 0.269908 0.378361 0.378521
chargesum: 0.00000
title: Mulliken charges with hydrogens summed into heavy atoms:
elementType: O O O O O N N C C C C C C C C C
charge: -0.288625 -0.035383 -0.226662 -0.024659 -0.265246 -0.161251 -0.001962 0.163882 0.005185 0.015852 0.118716 0.205671 0.021243 0.198400 0.063178 0.211660
polarizability: 1.31696137e+02 -1.98929854e+00 1.16496708e+02 -7.60702975e+00 -1.55338378e+00 1.19874029e+02
1716.lowfreq: -8.1848 -6.1786 -0.0008 -0.0007 -0.0003 3.2330 22.3958 36.2638 47.7525
frequency: 22.3361 36.2335 47.7065 58.2860 80.7518 94.3169 128.9871 143.0046 155.4543 180.0327 243.2714 258.5448 269.9843 290.7848 309.4403 334.3668 374.9314 399.8065 451.9543 496.8026 532.6848 554.5174 587.8872 591.4108 622.2076 651.0019 688.8751 703.8264 718.6042 753.5383 782.4129 819.8409 873.5871 875.8404 906.8406 921.8685 937.7791 964.7133 988.0548 1021.2800 1045.4308 1062.3043 1070.2001 1101.0284 1108.6714 1149.7854 1159.2217 1166.3708 1188.3722 1197.3553 1242.1999 1250.8442 1259.6047 1263.6829 1288.7322 1303.9167 1326.5909 1338.7949 1351.2828 1357.4434 1371.2099 1398.4239 1434.7956 1469.5948 1475.6414 1493.4767 1565.8562 1649.5858 1652.7299 1668.1921 2969.6499 3006.0038 3017.0271 3026.2810 3057.1633 3065.4701 3076.2070 3077.7166 3088.1642 3101.0959 3413.7628 3510.2621 3516.5775 3539.6882
redmass: 7.4579 4.9047 8.7908 8.9622 5.6330 8.2277 3.1939 3.8914 4.5773 3.4029 2.5377 2.4564 1.9006 4.8566 1.7205 5.6773 5.6844 5.3970 3.8327 2.5768 2.4377 2.2913 2.0000 3.7583 1.9314 1.4932 3.4864 3.9264 2.3903 2.6868 2.7089 4.6883 2.3409 2.9217 1.5854 2.5006 4.0163 2.0590 2.1102 2.7030 2.6630 1.7633 1.7908 1.8041 2.6047 1.9646 1.3712 1.4820 1.8882 1.5139 1.2859 1.4918 1.5194 1.6671 1.6038 1.3294 1.3106 1.4096 1.6449 1.6416 1.8753 3.3962 1.1207 1.0864 1.0915 1.0954 7.4146 1.1345 6.1349 8.5928 1.0664 1.0615 1.0636 1.0617 1.0874 1.0859 1.0981 1.0968 1.1015 1.1057 1.0455 1.0639 1.0641 1.0953
irintensity: 1.2129 0.5870 2.6637 1.3179 2.1312 1.8254 2.1017 0.3718 1.4985 1.8019 13.9885 14.7720 11.4342 4.2715 49.8389 3.6435 11.8331 14.1304 16.4145 34.4117 46.6723 21.9400 47.6483 27.5333 76.4570 111.2686 72.6143 13.2382 70.1031 193.3508 8.1891 4.2083 1.5958 6.2515 8.9359 9.3194 5.4668 46.6571 7.8687 81.1105 275.6982 14.6296 201.4562 6.9623 8.6581 4.0994 12.5588 3.2720 15.4341 11.7766 25.0902 11.2264 5.7292 0.1493 25.6674 3.9087 2.4868 2.5110 65.8727 36.8032 57.4765 69.8270 69.1160 7.6953 14.8514 1.6550 196.5083 37.7944 241.1366 168.7167 50.9034 9.5062 24.2625 22.8536 8.3425 6.7371 4.5120 17.1578 12.0914 31.3004 2.0857 24.7251 28.4723 3.7319
temp: 298.150 k
press: 1.00000 atm
elementType: 8 8 8 8 8 7 7 6 6 6 6 6 6 6 6 6 1 1 1 1 1 1 1 1 1 1 1 1 1 1
symmnumber: 1
zpe: 620563.9 jmol-1
zpe.correction: 0.236360 hartree
zpe.thermalcorrener: 0.252832 hartree
zpe.thermalcorrenthalpy: 0.253776 hartree
zpe.thermalcorrgfe: 0.190546 hartree
zpe.sumelectzpe: -835.763761 hartree
zpe.sumelectthermal: -835.747289 hartree
zpe.sumelectthermalent: -835.746345 hartree
zpe.sumelectthermalfe: -835.809576 hartree
dipole: -2.1974 -0.7078 2.4923
dipole: 3.3972
quadrupole: -88.4050 -84.8659 -96.1583
quadrupole: 1.3799 -1.1853 -5.0029
quadrupole: 1.4047 4.9438 -6.3486 1.3799 -1.1853 -5.0029
hfenergy: -836.0001213 hartree
pointgroup: C01 [X(C9H14N2O5)]
dipole: -0.998503 0.5388838 -0.7063862 debye
polarizability: 132.9166403|0.3760561|118.1243634|6.8828616|-1.290253|117.0258711 unknown
InChI: InChI=1S/C9H14N2O5/c10-5(4-7(12)13)8(14)11-3-1-2-6(11)9(15)16/h5-6,12,15H,1-4,10H2
charge 0 multiplicity 1
30 atoms
O  0.24377 0.244691 2.057819
O  -2.871251 -1.801954 1.522378
O  -1.174721 -1.986035 -0.056357
O  3.216456 -1.623903 -0.961998
O  1.8459 -0.089998 -2.023967
N  -0.818442 0.882564 0.10652
N  2.112717 2.417444 1.493169
C  -2.07605 0.256536 0.569056
C  -3.111863 0.693778 -0.508392
C  -2.25438 0.821476 -1.793101
C  -0.918639 1.41448 -1.285872
C  0.294213 0.812842 0.912998
C  1.620596 1.478987 0.458717
C  -1.938805 -1.271117 0.623164
C  2.694795 0.384948 0.25363
C  2.506972 -0.42307 -1.011378
H  -2.339681 0.597064 1.583387
H  -3.53298 1.673866 -0.219671
H  -3.944322 -0.022084 -0.603365
H  -2.073655 -0.175578 -2.231184
H  -2.726769 1.458617 -2.558979
H  -0.057021 1.083606 -1.887262
H  -0.954703 2.522502 -1.269222
H  1.49185 2.035864 -0.484096
H  2.723439 -0.293237 1.124908
H  3.679316 0.888567 0.198662
H  2.106238 1.969807 2.421015
H  1.58344 3.297672 1.516424
H  -2.780612 -2.792984 1.543599
H  3.078791 -2.122653 -1.8131
