program: Gaussian 09
title: 000170661
version: EM64L-G09RevD.01
frameworkgroup: C1[X(C11H18N2O6S2)]
method: RPBEPBE
basis: SDD
operation: Freq
keyword: #p
keyword: freq=noraman
keyword: PBEPBE/SDD
title: #p freq=noraman PBEPBE/SDD
converged: NO YES NO NO
title: Mulliken charges:
elementType: S S O O O O O O N N C C C C C C C C C C C H H H H H H H H H H H H H H H H H H
charge: 0.893872 0.897633 -0.593934 -0.563240 -0.624734 -0.569951 -0.293932 -0.292311 -0.330938 -0.340596 -0.590787 -0.578719 -0.494829 -0.514422 -0.423871 0.230687 0.309530 -0.226042 -0.241168 -0.460565 -0.469580 0.283158 0.333470 0.301480 0.302988 0.265294 0.276153 0.277157 0.261005 0.267309 0.269222 0.375568 0.339654 0.324142 0.355052 0.246197 0.279192 0.244813 0.276042
chargesum: 0.00000
title: Mulliken charges with hydrogens summed into heavy atoms:
elementType: S S O O O O O O N N C C C C C C C C C C C
charge: 0.893872 0.897633 -0.593934 -0.563240 -0.624734 -0.569951 -0.293932 -0.292311 0.044630 -0.000942 0.025841 0.025749 0.046618 0.023741 0.112661 0.230687 0.309530 0.098100 0.113884 0.064824 0.051275
polarizability: 2.05385302e+02 8.53352734e+00 2.41651997e+02 6.34091265e+00 1.53261327e+01 1.58229446e+02
1716.lowfreq: -5.0966 -0.0007 0.0010 0.0011 1.5209 7.3498 24.8129 37.7916 44.2549
frequency: 24.6945 37.7091 44.2149 47.5936 60.2621 73.0718 76.3025 83.0554 88.7404 111.3218 116.9433 127.5103 162.1494 171.2363 179.4250 189.4961 195.8350 204.3350 213.0669 238.0371 250.1327 261.6557 288.8658 295.2146 303.9790 328.0178 338.8473 359.7621 383.8239 418.0950 434.7193 455.9443 484.8798 508.9866 519.7471 530.4314 555.8314 567.3560 610.3374 633.9045 648.0920 654.0964 686.6722 709.7565 766.8473 773.5596 789.3063 817.9751 860.5930 873.2418 883.5385 906.4696 908.8311 921.6004 940.0014 950.1763 954.1523 982.4507 985.2882 992.3804 1002.1470 1004.2445 1025.0326 1066.4598 1073.4895 1093.9445 1140.4575 1147.5270 1173.3050 1183.1925 1185.6677 1215.2165 1223.6023 1268.5918 1275.0998 1289.5193 1301.7215 1326.2312 1351.8065 1367.0064 1373.4347 1379.7013 1396.5597 1417.7235 1419.4921 1435.4009 1448.7174 1489.3041 1556.9391 1605.7461 1608.3466 1612.6572 1615.8452 2987.1272 2996.2342 3026.4685 3046.3787 3058.9824 3064.3714 3075.7683 3086.6379 3088.8937 3124.2913 3138.9867 3155.0881 3156.0056 3157.0129 3187.8580 3203.9186 3207.6174 3522.3679
redmass: 6.7391 6.9517 5.8372 5.0930 5.6895 7.4799 6.4190 4.7107 4.7754 4.6551 5.3504 5.3180 3.3069 3.6878 3.4029 4.4015 3.9189 5.2723 4.1589 5.6336 3.3067 3.1029 3.5876 5.8106 5.0726 4.5867 5.9829 3.4537 3.2304 3.7188 3.4080 2.9135 3.6523 3.8838 4.2010 3.5973 3.9548 3.7791 2.4084 1.9994 1.8497 2.2031 2.2185 3.3011 9.5145 10.2768 2.6987 1.7852 2.3415 2.3048 4.4755 1.1705 3.0441 2.0515 1.7822 1.8569 1.1841 1.3106 1.4941 1.4399 1.2522 3.8467 3.4233 1.9858 4.0780 2.3201 1.1814 1.1187 1.2376 1.4218 1.2507 1.2144 1.6981 1.2094 1.2054 1.1718 1.7073 1.9428 1.5585 1.1511 1.1483 1.2678 1.1139 1.0972 1.0890 1.1362 1.0744 1.9336 1.8144 3.8474 4.5782 4.6442 5.0513 1.0612 1.0653 1.0587 1.0952 1.0595 1.0607 1.0963 1.0583 1.0590 1.1094 1.1041 1.1037 1.1109 1.0928 1.1066 1.1148 1.1130 1.0778
irintensity: 3.8354 2.7171 1.3630 3.2595 6.3730 19.1106 2.9134 6.0881 5.9089 1.3310 6.6994 3.0969 7.3122 1.4548 12.6922 8.6223 1.1851 2.6818 1.4365 16.4217 4.4669 7.6571 3.2336 24.1905 38.4966 15.3875 16.6984 15.7730 1.2506 18.4696 7.3979 8.1280 0.8111 1.3392 2.6517 13.3283 26.2246 7.0885 18.4147 53.2650 64.8499 9.1114 110.2948 47.1578 26.4571 115.7820 45.6854 15.4153 82.2453 99.8101 95.8170 19.0361 28.4969 15.4245 12.5687 24.7263 5.0067 91.6127 1.9287 25.5303 72.6017 32.7208 19.6070 13.3144 29.8796 29.8737 3.0983 12.1398 72.4717 0.1871 8.4225 7.9640 43.9620 7.1064 15.4189 37.3221 20.0451 49.2732 14.0259 20.5831 26.9421 20.8430 25.2389 6.6233 31.7098 10.9568 34.8274 216.3066 169.2662 295.1502 24.5231 6.9859 47.9601 6.1854 3.9196 14.8356 0.8906 3.2246 39.3656 1.6338 5.7709 3.1751 4.5779 99.7719 46.4294 2.9399 480.3209 20.0760 3.6453 7.9047 45.8332
temp: 298.150 k
press: 1.00000 atm
elementType: 16 16 8 8 8 8 8 8 7 7 6 6 6 6 6 6 6 6 6 6 6 1 1 1 1 1 1 1 1 1 1 1 1 1 1 1 1 1 1
symmnumber: 1
zpe: 761654.6 jmol-1
zpe.correction: 0.290099 hartree
zpe.thermalcorrener: 0.314836 hartree
zpe.thermalcorrenthalpy: 0.315780 hartree
zpe.thermalcorrgfe: 0.234696 hartree
zpe.sumelectzpe: -1784.969729 hartree
zpe.sumelectthermal: -1784.944992 hartree
zpe.sumelectthermalent: -1784.944048 hartree
zpe.sumelectthermalfe: -1785.025132 hartree
dipole: 2.9085 -0.0096 -0.9236
dipole: 3.0516
quadrupole: -145.6264 -130.0000 -146.6870
quadrupole: -10.9545 9.1679 1.1986
quadrupole: -4.8552 10.7711 -5.9159 -10.9545 9.1679 1.1986
hfenergy: -1785.259828 hartree
pointgroup: C01 [X(C11H18N2O6S2)]
dipole: 0.915388 0.1760707 -0.7566207 debye
polarizability: 199.645302|4.4596416|245.7380782|-13.4005956|7.2158167|159.8833653 unknown
InChI: InChI=1S/C11H18N2O6S2/c1-3-20(16,17)7-5-10(14)12-9-13-11(15)6-8-21(18,19)4-2/h3-4,12-13H,1-2,5-9H2
charge 0 multiplicity 1
39 atoms
S  -2.186794 1.158909 1.020042
S  1.765128 1.260849 -1.403776
O  -0.838678 0.643029 1.834558
O  -3.535547 1.481451 1.8893
O  0.227895 0.650248 -1.517285
O  2.22741 2.461326 -2.419289
O  -1.788201 -3.572171 -0.160608
O  2.355889 -1.021562 0.837466
N  -0.840024 -2.138639 1.402246
N  1.10664 -2.856733 0.148204
C  -2.630012 -0.197101 -0.307276
C  3.03569 -0.209734 -1.708235
C  -3.013409 -1.516506 0.383411
C  2.345704 -1.554939 -1.55317
C  0.379093 -2.959446 1.428815
C  -1.8421 -2.497721 0.527397
C  1.946011 -1.793122 -0.08833
C  -1.747021 2.684771 -0.013241
C  1.938803 1.916417 0.374471
C  -2.453802 3.802242 0.219362
C  2.522689 3.117346 0.513818
H  -3.479797 0.271988 -0.827867
H  -1.731093 -0.230681 -0.947027
H  3.810518 -0.026373 -0.949263
H  3.377441 0.013777 -2.730867
H  -3.764446 -2.024016 -0.245919
H  -3.498536 -1.31226 1.358491
H  1.449807 -1.609432 -2.200447
H  3.044429 -2.346952 -1.890501
H  1.033239 -2.596137 2.233761
H  0.108477 -4.014813 1.586814
H  -0.803644 -1.163346 1.774774
H  0.691714 -3.374491 -0.632359
H  -0.94338 2.451665 -0.71966
H  1.468991 1.241777 1.094943
H  -2.242706 4.719083 -0.342532
H  -3.252384 3.819423 0.973242
H  2.609482 3.570004 1.508071
H  2.911424 3.667969 -0.352734
