program: Gaussian 09
title: 000170579
version: EM64L-G09RevD.01
frameworkgroup: C1[X(C8H10BrN)]
method: RPBEPBE
basis: SDD
operation: Freq
keyword: #p
keyword: freq=noraman
keyword: PBEPBE/SDD
title: #p freq=noraman PBEPBE/SDD
converged: NO NO NO NO
title: Mulliken charges:
elementType: Br N C C C C C C C C H H H H H H H H H H
charge: -0.032276 -0.693833 0.368450 0.470770 0.437699 -0.585770 -0.395238 -0.402081 -0.843010 -0.812469 0.231381 0.245106 0.227223 0.227197 0.239271 0.233424 0.223746 0.221826 0.322609 0.315975
chargesum: 0.00000
title: Mulliken charges with hydrogens summed into heavy atoms:
elementType: Br N C C C C C C C C
charge: -0.032276 -0.055249 0.368450 0.470770 0.437699 -0.354390 -0.150131 -0.402081 -0.149319 -0.133473
polarizability: 1.48575202e+02 -4.58336262e+00 1.30317888e+02 1.98627249e-01 -2.89923279e-01 5.22372806e+01
1716.lowfreq: -0.0005 -0.0004 0.0002 6.8813 9.9843 16.5817 65.5947 101.9382 154.5605
frequency: 65.3057 101.9201 154.5596 178.0913 203.6545 212.5072 237.7921 298.3648 327.6951 337.5840 341.7955 449.2794 452.6292 491.3887 498.9219 557.1282 570.2615 734.7273 749.3116 799.0615 863.9693 897.2483 943.6722 978.4779 1015.0336 1041.6158 1044.7420 1048.1885 1149.4378 1239.3241 1254.0424 1320.1705 1369.2173 1395.9458 1397.1695 1411.8932 1472.3295 1473.4462 1474.3192 1477.9809 1503.9476 1563.4181 1613.4222 1637.0481 2949.8344 2967.1458 3017.0525 3047.4497 3075.8159 3084.5986 3116.0399 3141.1635 3557.3505 3706.9046
redmass: 1.0140 3.9476 3.4518 5.6189 1.5648 1.5471 4.4921 3.4710 1.1755 4.0881 3.1867 1.1244 5.1909 3.7248 3.1869 3.9910 3.1285 4.8519 5.3282 4.8942 1.3373 1.3181 3.7105 1.5669 1.4601 1.4934 1.5961 1.5255 1.8673 2.4536 1.4482 3.6999 4.6165 1.2804 1.2480 3.4074 1.1961 1.0594 1.0569 1.2745 2.3960 6.0718 1.9621 2.0274 1.0392 1.0384 1.0976 1.0953 1.0994 1.0954 1.0913 1.0924 1.0460 1.1025
irintensity: 0.6393 0.1348 9.1386 0.2348 0.4756 3.0010 3.6879 0.7636 178.0990 6.0749 1.7562 94.7366 0.8162 2.0159 0.5340 5.2078 3.5969 12.5441 37.6354 6.0188 22.1886 1.0798 5.0071 16.3748 9.2177 4.2544 43.1239 20.7525 2.7633 4.6190 10.5037 29.4875 10.5184 14.5181 2.6127 4.8475 10.0809 11.9910 16.5618 27.9350 139.1570 12.2773 40.7809 157.4726 45.6301 52.4317 26.3489 25.1468 18.6628 14.4499 22.0470 5.1084 56.6867 35.4288
temp: 298.150 k
press: 1.00000 atm
elementType: 35 7 6 6 6 6 6 6 6 6 1 1 1 1 1 1 1 1 1 1
symmnumber: 1
zpe: 418761.1 jmol-1
zpe.correction: 0.159498 hartree
zpe.thermalcorrener: 0.170322 hartree
zpe.thermalcorrenthalpy: 0.171266 hartree
zpe.thermalcorrgfe: 0.122562 hartree
zpe.sumelectzpe: -378.334796 hartree
zpe.sumelectthermal: -378.323972 hartree
zpe.sumelectthermalent: -378.323028 hartree
zpe.sumelectthermalfe: -378.371732 hartree
dipole: 1.5786 1.9312 0.0533
dipole: 2.4949
quadrupole: -64.9624 -56.7676 -74.1290
quadrupole: -1.4957 0.0895 -0.0568
quadrupole: 0.3239 8.5187 -8.8427 -1.4957 0.0895 -0.0568
hfenergy: -378.4942941 hartree
pointgroup: C01 [X(C8H10Br1N1)]
dipole: 0.1528243 -0.9693301 0.022183 debye
dipolederiv: -0.3458722 -0.2901005 -0.0010276 -0.294322 -0.5035723 -0.0004339 -0.0001768 0.0041487 -0.0594805 -1.371537 0.2444509 -0.0002066 0.2259427 -0.2189588 -0.0005073 -0.0025717 0.0006119 -0.6948793 -0.188987 0.2637129 0.0019892 -0.293305 0.268604 0.0026645 0.0068963 0.0035245 -0.0630344 0.1826136 -0.0960093 -0.0098817 0.0110225 -0.1854831 0.0026006 -0.0949743 0.0148219 -0.060784 1.1753968 -0.547108 0.0058518 -0.3031699 -0.3319848 0.0009246 0.0080873 0.0001782 0.1104584 -0.0000668 -0.1241734 -0.0039571 0.083354 0.1120978 -0.0055074 0.0058292 -0.0100549 -0.1812968 -0.0984459 0.1252081 -0.0035205 -0.2469019 -0.1358691 0.0063695 0.0084258 0.0120434 -0.111427 0.2235927 0.4318839 0.0013403 0.8457766 0.7690347 -0.0049013 0.0016887 -0.0117196 -0.1577935 0.00249 0.0204598 -0.0016421 0.057306 -0.0458814 0.0002161 -0.004056 -0.0013722 0.1022232 -0.040514 0.0260596 -0.0028108 -0.0014897 0.0468775 0.000197 0.0887596 -0.0153035 0.0855826 0.0046403 -0.1068301 -0.0030475 -0.1161746 -0.0518695 0.001534 -0.0059432 -0.0018523 0.1445424 0.0805991 0.0628678 -0.003527 0.06668 -0.0459781 -0.0005761 -0.0059364 0.0031827 0.1532324 0.0023692 0.1001891 0.1220138 0.0274593 0.0138106 -0.0007977 0.1083329 -0.0722457 -0.05103 0.0046925 0.0991063 -0.1209435 0.0290933 0.0142229 0.0021579 -0.1073621 0.0729706 -0.0538198 -0.0321011 -0.1686458 -0.0012078 -0.0611958 -0.0225558 -0.0005779 -0.0009264 -0.0014989 0.1105485 -0.0728857 0.0229883 0.0646474 0.0268811 0.1075808 -0.0094167 0.1399854 -0.0188677 -0.1091828 0.0329475 0.0114042 -0.0048776 0.1056363 -0.0846513 0.1029083 -0.0608105 0.0884024 0.0565489 -0.0252516 -0.045437 -0.0384054 -0.1267868 -0.0434448 -0.0971873 -0.0839324 -0.0674149 0.0547264 0.2306821 -0.0008667 -0.0003409 -0.0215082 0.136839 0.000608 -0.000779 0.0004843 0.3555705 0.2356373 -0.0291603 -0.0004462 -0.0142977 0.2011817 -0.0002749 -0.0005364 -0.0000389 0.3692947 unknown
polarizability: 142.9763137|9.5852879|135.9173574|-0.2756904|-0.0379765|52.2366993 unknown
InChI: InChI=1S/C8H10BrN/c1-5-3-6(2)8(10)7(9)4-5/h3-4H,10H2,1-2H3
charge 0 multiplicity 1
20 atoms
Br 1.810975 2.637523 -0.004463
N  2.503094 -0.447825 0.009637
C  0.20445 -1.321847 -0.001204
C  -1.71672 0.254145 -0.014606
C  1.126632 -0.223097 0.003657
C  -1.18356 -1.06121 -0.011999
C  -0.802794 1.3361 -0.01374
C  0.583099 1.09239 -0.002021
C  0.737812 -2.743347 -0.001374
C  -3.217449 0.502432 0.006906
H  -1.874421 -1.91423 -0.017958
H  -1.17233 2.367501 -0.020601
H  1.366128 -2.949615 -0.89233
H  1.354703 -2.953474 0.896618
H  -0.090883 -3.470865 -0.008239
H  -3.604787 0.563716 1.043268
H  -3.478238 1.450305 -0.497686
H  -3.766122 -0.311291 -0.501432
H  2.874758 -1.391395 0.012285
H  3.147152 0.339287 0.010681
