program: Gaussian 09
title: 000170595
version: EM64L-G09RevD.01
frameworkgroup: C1[X(C5H10O7S4)]
method: RPBEPBE
basis: SDD
operation: Freq
keyword: #p
keyword: freq=noraman
keyword: PBEPBE/SDD
title: #p freq=noraman PBEPBE/SDD
converged: YES YES NO NO
title: Mulliken charges:
elementType: S S S S O O O O O O O C C C C C H H H H H H H H H H
charge: 0.111865 0.124648 0.967594 0.967773 -0.244410 -0.556212 -0.549005 -0.464560 -0.472826 -0.465038 -0.478521 0.431453 -0.339383 -0.343502 -0.879904 -0.881697 0.210819 0.262389 0.236084 0.237696 0.354283 0.326375 0.341220 0.323832 0.388888 0.390141
chargesum: 0.00000
title: Mulliken charges with hydrogens summed into heavy atoms:
elementType: S S S S O O O O O O O C C C C C
charge: 0.111865 0.124648 0.967594 0.967773 -0.244410 -0.167324 -0.158863 -0.464560 -0.472826 -0.465038 -0.478521 0.431453 0.133825 0.130277 -0.199247 -0.216645
polarizability: 3.26137059e+02 1.17826565e+01 1.71988798e+02 9.29449933e+00 8.11259300e-02 1.29732501e+02
1716.lowfreq: -10.8162 -6.6094 -0.0010 0.0015 0.0022 11.3604 13.0534 21.1036 35.9631
frequency: 12.6072 20.7948 35.9429 41.7169 49.6805 77.2415 91.7974 98.3486 130.1001 141.3660 142.2194 156.0090 163.5128 177.1788 200.2595 205.6696 217.1309 250.0920 262.9656 286.1618 300.4413 309.7096 312.9929 317.5852 346.0616 349.9538 401.4430 408.4699 450.6056 521.5207 531.3919 642.6070 664.6414 677.7386 789.9215 800.1752 835.6342 837.6621 861.4071 888.8312 915.9511 935.9020 955.3736 955.9924 957.0062 1029.8758 1053.5364 1061.2269 1084.7825 1092.0273 1109.5666 1177.9759 1220.0663 1269.9599 1279.1332 1293.5271 1300.8038 1321.3747 1402.1459 1414.1872 1469.4693 1488.7687 2950.3972 2967.4785 2995.2573 3014.3486 3037.5625 3051.3169 3089.1351 3091.4067 3452.3223 3452.9839
redmass: 9.9948 8.8078 11.6680 8.8455 10.1332 7.8879 17.5584 5.1920 5.2615 3.0062 5.5107 3.6228 6.1381 2.9620 1.9904 1.9168 4.2843 9.6534 4.2521 6.8534 7.6254 8.5520 8.0657 5.6431 2.5827 2.4526 11.0509 13.2922 2.5835 18.2572 18.1724 4.5915 5.6764 5.1806 2.0350 3.3156 15.2599 15.7961 2.3707 2.5157 8.2294 2.0445 4.7239 1.8702 12.8124 2.2086 1.1770 1.2010 1.3976 1.1434 1.4112 1.4704 1.3002 1.3482 1.2766 1.7702 1.3622 1.5670 1.0840 1.0757 1.0772 1.0970 1.0644 1.0597 1.0607 1.0582 1.1012 1.0963 1.1076 1.1086 1.0660 1.0660
irintensity: 0.3767 0.5363 1.5335 0.2355 0.6963 0.3838 0.3565 15.7269 8.1532 25.9415 7.9277 12.2943 0.6227 18.8501 55.4846 45.1073 14.6112 12.3971 19.1826 40.7906 16.3867 19.6322 21.4499 2.4326 0.9776 3.0785 109.7312 44.6077 1.2607 142.5079 114.6230 3.3000 3.0649 6.0166 8.2633 17.7948 117.3131 38.8702 12.2670 1.2336 29.4625 10.8756 47.5423 50.1029 64.7699 1.0330 56.1394 75.0457 0.1196 0.6105 3.5892 10.5715 7.0355 5.2431 12.1184 18.4412 1.6430 31.2237 34.6690 25.1492 4.9772 2.5251 1.4319 8.5584 44.3151 25.2407 4.3151 4.1597 4.5152 19.3105 67.4288 62.8138
temp: 298.150 k
press: 1.00000 atm
elementType: 16 16 16 16 8 8 8 8 8 8 8 6 6 6 6 6 1 1 1 1 1 1 1 1 1 1
symmnumber: 1
zpe: 424078.9 jmol-1
zpe.correction: 0.161523 hartree
zpe.thermalcorrener: 0.182830 hartree
zpe.thermalcorrenthalpy: 0.183774 hartree
zpe.thermalcorrgfe: 0.107673 hartree
zpe.sumelectzpe: -2313.653466 hartree
zpe.sumelectthermal: -2313.632160 hartree
zpe.sumelectthermalent: -2313.631216 hartree
zpe.sumelectthermalfe: -2313.707316 hartree
dipole: 0.6820 0.2970 -0.4281
dipole: 0.8583
quadrupole: -134.8377 -137.7391 -122.3096
quadrupole: -1.1550 18.8179 -0.5196
quadrupole: -3.2089 -6.1103 9.3192 -1.1550 18.8179 -0.5196
hfenergy: -2313.8149896 hartree
pointgroup: C01 [X(C5H10O7S4)]
dipole: 0.2714682 0.1137927 -0.1654452 debye
dipolederiv: -0.029535 0.3060603 0.0287386 0.1092673 -0.1707069 0.0059492 0.0802582 -0.0787729 -0.0713095 -0.2024776 -0.1835799 0.0079752 0.0126301 -0.2252221 -0.0439868 0.0685986 0.0514938 -0.0446174 1.794762 -0.0952757 0.0400758 -0.4768235 1.0375036 -0.13265 0.1920631 -0.1372505 1.33147 1.886085 0.0414638 0.0669525 0.2599603 1.0928351 0.1470458 0.3258491 0.0991892 1.4111457 -0.3627325 -0.0152456 -0.1112839 0.0920071 -0.413072 -0.0271145 -0.0086026 0.0644926 -0.4327763 -0.5948441 -0.0599905 -0.2369978 0.1928411 -0.5084892 0.2181762 -0.4872275 0.1101914 -0.7642289 -0.4350019 0.0466248 -0.1598186 -0.0528101 -0.5084647 -0.1752272 -0.3258927 -0.1529388 -0.8960353 -1.0074141 -0.2325551 0.0662 -0.0657693 -0.4332445 0.0522217 0.0307896 0.0181024 -0.4155953 -0.6287521 0.0170624 0.0061563 0.2753883 -0.3553909 -0.1377009 0.1779947 0.0006546 -0.5048758 -0.9259675 0.1384064 0.0316503 0.0695784 -0.4137986 -0.0475435 -0.0848241 0.0241304 -0.4210827 -0.669061 -0.0183006 -0.0151458 -0.1790688 -0.4553529 0.1101319 0.0843363 0.0561192 -0.4699217 -0.0110255 -0.0031295 -0.0947758 0.0735766 -0.0218518 0.0154004 -0.506368 0.0061532 -0.0800757 0.2401591 0.0831031 -0.0110178 -0.0760442 -0.026926 0.106233 0.0528657 -0.0995066 0.3819925 0.191133 -0.061171 0.0985651 -0.1335758 -0.0339914 -0.104721 0.2399777 0.0113849 0.3342092 0.1673884 0.083047 0.0726473 0.2052365 0.0035373 -0.0071092 0.0607645 0.0725354 -0.0302311 0.2847551 -0.1231007 0.0611996 -0.3286655 0.0706214 -0.0089029 -0.0543296 -0.0448726 -0.0305807 -0.0150422 -0.0213471 0.1087631 -0.0060975 0.1157844 -0.0144421 0.0813987 0.0478494 -0.1485077 -0.0509333 0.0201298 -0.0454214 -0.0028823 0.0946177 -0.026567 0.0469653 -0.0145702 0.0440177 0.1017676 0.0347544 0.0166679 0.0902168 0.1225384 0.0352011 -0.015788 -0.0261033 -0.1111822 -0.1391281 -0.0240808 0.0000966 -0.0796114 0.1184797 0.0165825 0.007872 -0.0072914 0.0328708 0.0024236 0.0097307 0.0290245 0.0208315 0.1033896 -0.0497555 -0.0209267 -0.0404309 0.1062855 0.0388954 0.0053424 -0.0938381 -0.1044032 0.0533955 0.0246151 -0.0342259 0.0258654 0.0498734 -0.0371979 0.023813 0.039174 -0.0141899 0.0958373 0.0735638 0.0599614 0.0027557 0.1055543 0.0331803 -0.0022228 -0.1007132 0.1136844 0.0537579 -0.0138928 -0.0348002 0.0049246 0.0790768 0.2123684 0.0554431 0.1110942 0.065214 0.2938046 0.0074648 0.0506272 0.0408628 0.2615739 0.1561949 -0.0249819 0.0840313 -0.0604909 0.3104084 -0.0229724 0.0126631 -0.0349678 0.2829506 unknown
polarizability: 325.7652322|11.8016514|171.9579892|12.6473647|-0.4125271|130.1351371 unknown
InChI: InChI=1S/C5H8OS2.2HO3S/c7-3-5(4-8)1-6-2-5;2*1-4(2)3/h1-4H2;2*1H
charge 0 multiplicity 1
26 atoms
S  -1.982005 -1.479959 -0.13454
S  1.99949 -1.562935 -0.000254
S  -4.070113 -0.274955 0.222177
S  4.01305 -0.217159 0.086157
O  -0.296866 2.724076 0.076962
O  -4.088557 0.545341 -1.445563
O  3.75544 0.377763 1.820643
O  -5.357051 -1.235531 0.339116
O  -3.80744 0.868094 1.340247
O  5.368212 -1.085137 0.038534
O  3.825823 1.041182 -0.91681
C  0.039201 0.560137 -0.112644
C  -0.712188 1.671665 -0.924281
C  0.684449 1.749673 0.683261
C  -0.896486 -0.252072 0.79814
C  0.976755 -0.301075 -0.965767
H  -0.27141 1.879713 -1.918063
H  -1.807986 1.584819 -1.001608
H  0.60337 1.727818 1.782744
H  1.719467 1.984286 0.376037
H  -1.586123 0.423718 1.348335
H  -0.339052 -0.850387 1.541448
H  1.698933 0.323508 -1.530056
H  0.415812 -0.913453 -1.69836
H  -4.969582 1.013765 -1.55469
H  4.624556 0.751003 2.157231
