program: Gaussian 09
title: 000170610
version: EM64L-G09RevD.01
frameworkgroup: C1[X(C12H13Br2Cl2O4P)]
method: RPBEPBE
basis: SDD
operation: Freq
keyword: #p
keyword: freq=noraman
keyword: PBEPBE/SDD
title: #p freq=noraman PBEPBE/SDD
converged: YES YES NO NO
title: Mulliken charges:
elementType: Br Br Cl Cl P O O O O C C C C C C C C C C C C H H H H H H H H H H H H H
charge: 0.105081 0.112422 -0.003135 -0.030998 1.407718 -0.520168 -0.524674 -0.498304 -0.572107 0.318109 0.588557 -0.220575 -0.214667 -0.246915 -0.284670 -0.192953 -0.221731 -0.655946 -0.658888 -0.097928 -0.716160 0.225488 0.245682 0.225945 0.254531 0.263012 0.217395 0.227134 0.234872 0.212237 0.240807 0.231076 0.285603 0.264151
chargesum: 0.00000
title: Mulliken charges with hydrogens summed into heavy atoms:
elementType: Br Br Cl Cl P O O O O C C C C C C C C C C C C
charge: 0.105081 0.112422 -0.003135 -0.030998 1.407718 -0.520168 -0.524674 -0.498304 -0.572107 0.318109 0.588557 0.250595 0.265809 -0.246915 -0.021658 0.092650 0.042420 0.023455 0.025232 -0.097928 -0.716160
polarizability: 2.92297113e+02 -1.84624321e+01 2.02218687e+02 1.50953303e+01 4.95081618e+00 1.86454033e+02
1716.lowfreq: -33.3680 -8.0105 -0.0007 0.0012 0.0020 3.2238 6.6249 15.0067 23.2684
frequency: -33.1833 14.5190 23.2052 25.1981 28.7382 33.9833 40.6314 44.9729 59.2109 79.1293 95.6651 112.7405 119.6146 134.0543 155.2358 164.5288 165.1911 189.7959 202.7940 218.8854 233.6966 241.8445 258.4760 276.9842 292.7333 299.9728 316.7601 367.6434 371.6316 391.5996 404.7337 412.2668 442.7154 446.0037 516.1722 560.5682 594.1100 631.2673 640.5761 663.9764 691.1806 706.1028 731.2854 783.8937 802.5425 808.4854 827.9075 859.4557 861.9857 868.3775 878.5210 955.2815 1004.4767 1009.6760 1019.2604 1065.9323 1068.7882 1082.2880 1103.3469 1107.9404 1130.9704 1132.0623 1139.6612 1233.1170 1251.1915 1252.5469 1264.1768 1348.8322 1354.6952 1357.1907 1378.9376 1394.8843 1396.2285 1452.8073 1457.1360 1457.1744 1475.2628 1478.7632 1486.4863 1489.7246 1559.7378 1586.4695 1623.5836 2994.5096 2995.8813 2999.1907 3006.2858 3063.9923 3077.5576 3091.4579 3093.0107 3108.9314 3115.2514 3155.1570 3181.3775 3186.3872
redmass: 1.7836 5.1177 3.6965 4.6390 7.6888 9.2871 19.3584 5.5375 2.3746 6.7723 6.6338 6.9374 6.8731 17.2972 8.2429 19.7174 6.4704 7.6005 8.4431 4.0020 1.5074 1.5388 3.5222 3.8992 4.8741 9.1426 8.5375 9.6719 6.4339 7.8712 7.9941 7.4774 3.5671 8.5331 8.7447 6.6784 5.8950 8.1668 6.7938 8.9073 7.9479 5.9066 4.9378 6.1098 1.1003 1.0890 1.5457 7.8756 4.5274 1.4211 5.0691 1.3583 4.5265 2.4647 3.0104 5.1564 5.1295 2.9606 2.2290 2.4252 1.4316 1.4085 1.4191 2.0766 1.1475 1.1448 1.8641 4.6320 1.2577 1.2441 5.1149 1.2469 1.2425 2.6781 1.0414 1.0406 1.0558 1.0523 1.0790 1.0840 8.5605 7.3213 11.6248 1.0372 1.0364 1.0564 1.0588 1.1076 1.1061 1.0982 1.0976 1.1024 1.1031 1.0895 1.0963 1.0940
irintensity: 2.0021 0.7651 0.4952 0.3125 0.2777 0.1877 0.1134 0.8423 4.2690 0.8613 1.0267 0.6616 0.7191 0.6343 2.1282 0.4636 0.0521 2.5862 1.2339 1.1879 1.7599 1.4533 1.4687 19.0050 11.6562 6.9217 6.4993 4.6322 32.8034 6.9700 15.6807 21.3496 26.5254 16.0783 25.5737 48.4384 1.1325 6.9330 44.0645 77.0117 11.2329 112.6280 0.4307 130.9039 9.2477 2.1079 33.4729 114.3186 231.2296 25.4229 255.3225 3.4091 169.7145 138.9870 12.9480 168.0290 50.0712 46.0043 4.7361 36.7683 3.6935 4.9345 6.8121 35.7968 0.3600 1.5127 31.9652 8.9610 4.1034 3.0680 18.3652 28.4398 27.8380 66.2009 9.2073 15.8154 4.2154 6.1760 11.9321 11.4940 28.4118 95.2966 9.9505 15.9088 19.1569 30.9350 17.6595 6.7946 4.1978 26.7594 22.0429 37.6364 33.6638 2.1126 0.6727 1.6447
temp: 298.150 k
press: 1.00000 atm
elementType: 35 35 17 17 15 8 8 8 8 6 6 6 6 6 6 6 6 6 6 6 6 1 1 1 1 1 1 1 1 1 1 1 1 1
symmnumber: 1
zpe: 599802.7 jmol-1
zpe.correction: 0.228453 hartree
zpe.thermalcorrener: 0.253044 hartree
zpe.thermalcorrenthalpy: 0.253988 hartree
zpe.thermalcorrgfe: 0.167863 hartree
zpe.sumelectzpe: -2052.601296 hartree
zpe.sumelectthermal: -2052.576705 hartree
zpe.sumelectthermalent: -2052.575761 hartree
zpe.sumelectthermalfe: -2052.661886 hartree
dipole: -1.8548 -0.8624 4.3776
dipole: 4.8319
quadrupole: -150.8902 -166.6247 -157.1543
quadrupole: 7.8619 1.8809 -12.1901
quadrupole: 7.3329 -8.4016 1.0687 7.8619 1.8809 -12.1901
hfenergy: -2052.8297489 hartree
pointgroup: C01 [X(C12H13Br2Cl2O4P1)]
dipole: 1.0164421 -0.6371352 -1.4746981 debye
polarizability: 262.8857308|49.8484856|226.0355091|8.049985|-7.0220939|192.0485932 unknown
InChI: InChI=1S/C12H13Br2Cl2O4P/c1-3-18-21(17,19-4-2)20-11(12(13)14)9-6-5-8(15)7-10(9)16/h5-7H,3-4H2,1-2H3
charge 0 multiplicity 1
34 atoms
Br 1.758966 3.352433 -1.292921
Br -1.385911 3.013764 -2.153155
Cl -1.580994 1.401505 2.377111
Cl -4.81768 -2.490597 0.14727
P  1.6449 -0.698058 0.86237
O  1.135622 0.949558 0.493698
O  1.864693 -1.26282 -0.761665
O  3.175756 -0.337748 1.520543
O  0.755595 -1.607558 1.798791
C  -1.18234 0.370362 -0.200352
C  0.0193 1.241328 -0.323195
C  1.787899 -2.742673 -1.006591
C  4.121762 0.594113 0.812171
C  -1.966761 0.315526 0.979493
C  -1.549692 -0.47606 -1.279861
C  -3.071759 -0.547463 1.103043
C  -2.653148 -1.347348 -1.190968
C  1.780991 -2.918896 -2.52086
C  5.408579 0.565734 1.627986
C  -3.394336 -1.369779 0.007243
C  0.120785 2.328482 -1.140754
H  2.669239 -3.222348 -0.541135
H  0.870538 -3.134994 -0.531149
H  4.270524 0.229752 -0.221711
H  3.659493 1.595714 0.784589
H  -0.953933 -0.440718 -2.197385
H  1.745319 -3.995615 -2.770067
H  0.900433 -2.42803 -2.969194
H  2.690002 -2.48627 -2.971621
H  6.150228 1.247486 1.171588
H  5.219433 0.897495 2.662483
H  5.836464 -0.450357 1.657748
H  -3.65856 -0.574629 2.023887
H  -2.929506 -1.992394 -2.028828
