program: Gaussian 09
title: 000170581
version: EM64L-G09RevD.01
frameworkgroup: C1[X(C11H20O)]
method: RPBEPBE
basis: SDD
operation: Freq
keyword: #pfreq=noraman
keyword: PBEPBE/SDD
title: #p freq=noraman PBEPBE/SDD
converged: YES YES NO NO
title: Mulliken charges:
elementType: O C C C C C C C C C C C H H H H H H H H H H H H H H H H H H H H
charge: -0.454468 -0.457077 -0.533703 -0.333416 0.436051 0.440433 -0.502355 -0.825940 -0.819149 -0.305890 -0.691355 -0.401034 0.195053 0.230736 0.198116 0.225333 0.214290 0.212538 0.197808 0.228599 0.230941 0.218508 0.227328 0.222583 0.227338 0.234735 0.215690 0.217273 0.223046 0.195756 0.194705 0.337525
chargesum: 0.00000
title: Mulliken charges with hydrogens summed into heavy atoms:
elementType: O C C C C C C C C C C C
charge: -0.116943 -0.033627 -0.107915 -0.119126 0.436051 0.440433 -0.092009 -0.147892 -0.141900 -0.071154 -0.035346 -0.010572
polarizability: 1.69304227e+02 1.68308763e+00 1.25884476e+02 2.60763105e-01 -2.24484986e+00 9.26163145e+01
1716.lowfreq: -4.1407 -0.0004 0.0003 0.0004 3.2266 9.0033 22.8596 28.9389 39.2420
frequency: 22.6042 28.7667 39.1795 48.5156 56.0902 90.8033 115.4144 128.0922 151.2803 200.7247 225.5312 238.3138 243.2775 280.7084 305.3593 342.1872 376.8982 398.6253 446.6672 486.7927 500.6050 541.5479 585.8547 739.0716 779.4157 791.4860 804.3769 855.8664 877.2448 932.0107 938.6816 962.8713 967.2462 995.0323 1004.9571 1020.8420 1026.4183 1037.9350 1060.6018 1077.3228 1093.4104 1125.9077 1148.1862 1181.4254 1201.7671 1226.7151 1244.9324 1251.9334 1254.4659 1271.2149 1313.4043 1317.2890 1348.2698 1365.6257 1384.5313 1395.7536 1397.2940 1403.8900 1455.6282 1459.5935 1463.3069 1467.8694 1468.8413 1473.8289 1479.0690 1480.5255 1482.9302 1487.3386 1685.2746 1695.1721 2927.0438 2957.4176 2964.1334 2966.0242 2969.5320 2972.1474 2979.2133 2997.3293 3024.4459 3034.2311 3034.8585 3041.7491 3052.4026 3068.4176 3074.2871 3080.8059 3088.5544 3094.1846 3103.7425 3547.5008
redmass: 3.3653 3.3242 3.0972 2.8398 2.6679 1.9779 1.2311 1.3760 1.6920 2.3814 1.2727 2.7883 1.2060 2.1900 2.2644 3.3466 2.4852 2.1426 3.3368 2.7707 2.4632 2.2878 2.4616 1.8892 1.1987 1.6174 2.5084 1.4978 1.5523 1.7843 3.9941 1.8895 1.6331 2.7202 1.7025 1.6212 1.7092 1.6656 1.8502 1.9412 1.8456 1.9355 1.3815 1.1909 1.4636 1.8909 1.3646 1.2230 1.4222 1.1414 1.3956 1.5822 1.3525 1.3321 1.2260 1.2948 1.3067 1.4027 1.0751 1.0715 1.0795 1.0738 1.0548 1.0735 1.0693 1.0769 1.0713 1.0593 6.7973 6.8482 1.0621 1.0622 1.0586 1.0401 1.0423 1.0655 1.0353 1.0976 1.0976 1.0962 1.0928 1.0947 1.0938 1.0949 1.0993 1.1005 1.0967 1.0954 1.0897 1.0664
irintensity: 1.1618 0.5355 0.7277 1.7400 2.9169 1.2040 2.1229 0.5627 2.0089 2.3478 1.6568 5.2396 130.1464 18.1143 0.3894 1.2468 2.2150 1.5636 10.1614 2.4411 17.6876 6.1334 7.9161 1.4745 5.7183 1.3370 7.6708 26.3878 0.8155 0.9865 92.8187 8.3971 2.1936 6.8113 5.9598 1.9076 0.8471 7.9341 16.1197 10.1719 17.0901 8.9867 2.9262 13.0299 28.5880 0.6141 15.7240 5.9003 12.8963 0.3587 1.8215 1.8012 0.5985 2.9765 10.4986 21.3881 27.8440 7.5388 1.4900 1.3235 4.5478 0.0468 20.9236 2.9586 17.6605 7.2262 35.1826 5.2812 2.8744 19.7093 78.7651 45.1699 16.9034 34.7468 35.9977 48.7475 37.5763 56.3581 14.5669 18.7473 18.7839 24.5020 12.0735 42.9354 66.0693 59.7033 32.6642 33.5708 25.6183 6.1405
temp: 298.150 k
press: 1.00000 atm
elementType: 8 6 6 6 6 6 6 6 6 6 6 6 1 1 1 1 1 1 1 1 1 1 1 1 1 1 1 1 1 1 1 1
symmnumber: 1
zpe: 740061.6 jmol-1
zpe.correction: 0.281875 hartree
zpe.thermalcorrener: 0.297991 hartree
zpe.thermalcorrenthalpy: 0.298936 hartree
zpe.thermalcorrgfe: 0.235773 hartree
zpe.sumelectzpe: -505.365795 hartree
zpe.sumelectthermal: -505.349678 hartree
zpe.sumelectthermalent: -505.348734 hartree
zpe.sumelectthermalfe: -505.411896 hartree
dipole: -0.9095 1.0333 0.8509
dipole: 1.6183
quadrupole: -59.8136 -74.9799 -78.3945
quadrupole: -1.8614 -2.5727 -1.4529
quadrupole: 11.2491 -3.9173 -7.3318 -1.8614 -2.5727 -1.4529
hfenergy: -505.6476692 hartree
pointgroup: C01 [X(C11H20O1)]
dipole: -0.3418833 0.4114452 0.3452764 debye
polarizability: 169.3274851|-0.6598353|125.957526|1.560114|-0.9216292|92.5200072 unknown
InChI: InChI=1S/C11H20O/c1-4-10(2)6-5-7-11(3)8-9-12/h6,8,12H,4-5,7,9H2,1-3H3
charge 0 multiplicity 1
32 atoms
O  -4.425328 -1.635551 -0.464306
C  0.353863 0.657779 -0.669714
C  -0.529546 0.862159 0.606139
C  1.832215 0.737415 -0.35012
C  2.766358 -0.257229 -0.408548
C  -2.023222 0.881525 0.296081
C  4.215995 0.026744 -0.019267
C  2.476428 -1.680549 -0.854739
C  -2.543462 2.167724 -0.322601
C  -2.790026 -0.21238 0.573037
C  4.704191 -0.778525 1.214572
C  -4.26365 -0.394518 0.33454
H  -0.229727 1.81606 1.088389
H  -0.296052 0.051731 1.32112
H  0.098456 1.443352 -1.410382
H  0.082853 -0.308787 -1.129697
H  2.17289 1.728746 -0.007062
H  4.336494 1.10771 0.186047
H  4.879747 -0.210834 -0.877689
H  2.607774 -2.396286 -0.019769
H  1.453171 -1.808244 -1.242722
H  3.183577 -1.989157 -1.650122
H  -2.549126 2.985083 0.426014
H  -3.565658 2.073751 -0.724815
H  -1.884968 2.499287 -1.147644
H  -2.308287 -1.090097 1.028133
H  5.745985 -0.509261 1.468965
H  4.677562 -1.867347 1.027742
H  4.070148 -0.568344 2.095278
H  -4.706775 0.471123 -0.197395
H  -4.788456 -0.508117 1.309964
H  -5.379223 -1.905662 -0.447726
