program: Gaussian 09
title: 000170577
version: EM64L-G09RevD.01
frameworkgroup: C1[X(C6H13ClO2)]
method: RPBEPBE
basis: SDD
operation: Freq
keyword: #p
keyword: freq=noraman
keyword: PBEPBE/SDD
title: #p freq=noraman PBEPBE/SDD
converged: YES YES NO NO
title: Mulliken charges:
elementType: Cl O O C C C C C C H H H H H H H H H H H H H
charge: -0.061849 -0.262890 -0.271974 -0.250182 -0.250501 -0.162437 -0.206236 -0.587355 -0.678443 0.178405 0.212917 0.179765 0.204748 0.184690 0.217687 0.193000 0.179560 0.247807 0.272630 0.199647 0.224817 0.236194
chargesum: 0.00000
title: Mulliken charges with hydrogens summed into heavy atoms:
elementType: Cl O O C C C C C C
charge: -0.061849 -0.262890 -0.271974 0.141140 0.134012 0.239940 0.166324 -0.066918 -0.017784
polarizability: 9.04102988e+01 4.38882045e+00 9.07229059e+01 6.30925712e-01 -1.09724704e+00 6.42488233e+01
1716.lowfreq: -5.1345 -0.0030 -0.0029 -0.0012 3.1653 17.8995 25.4240 33.3765 62.0400
frequency: 24.3885 33.0974 62.0027 71.9120 122.4979 144.3749 180.8129 196.5179 239.7867 275.5686 321.0069 413.1349 452.8042 514.2231 613.4505 776.9757 797.0477 817.2928 902.7934 927.7471 963.6214 1011.6400 1036.4664 1048.3969 1078.7503 1097.7545 1102.8851 1129.1231 1140.4433 1172.3187 1202.2332 1225.8459 1250.1774 1253.8553 1298.0712 1334.9106 1345.6797 1387.3363 1396.5316 1414.6207 1431.6109 1451.2566 1458.6522 1459.0679 1471.8919 1480.3738 1493.7564 2888.6573 2909.4054 2916.9515 2933.7364 2960.9543 2975.7546 2979.0780 2994.3608 2994.6531 3061.2709 3092.1681 3102.4114 3144.4666
redmass: 5.6361 2.9889 2.0492 3.8277 4.1494 4.7295 2.3805 2.3661 1.1528 2.9011 2.6880 2.7855 2.6429 2.9947 4.9922 2.2501 2.4099 1.0961 2.0629 2.1276 1.8912 2.0324 2.5564 2.4562 3.2150 2.5026 3.7056 2.0338 1.4985 1.1893 1.1256 1.1611 1.1320 1.1348 1.1913 1.2118 1.2885 1.2685 1.3417 1.5366 1.1156 1.0827 1.0843 1.0431 1.0853 1.0489 1.0784 1.0646 1.0566 1.0580 1.0593 1.1048 1.0937 1.1027 1.0828 1.0525 1.0575 1.0991 1.1010 1.1100
irintensity: 0.7941 1.6299 5.7032 0.3979 7.7019 7.1100 1.6995 4.3696 0.6645 2.7582 0.0238 3.3906 9.3434 1.6807 24.3705 3.8676 5.7989 4.5175 13.3981 20.6046 25.0139 27.7597 9.9604 36.0456 129.3461 23.1592 67.6638 9.5579 8.9262 6.9166 9.2973 0.9984 2.1273 5.0332 23.3958 43.8910 13.6007 10.5637 16.8244 2.2155 13.1935 12.6019 14.0583 9.0560 9.7803 3.0676 5.5658 72.3698 28.3546 57.6238 144.4045 73.4760 40.4710 43.2505 75.8309 9.4382 27.0701 37.5487 36.3855 12.6212
temp: 298.150 k
press: 1.00000 atm
elementType: 17 8 8 6 6 6 6 6 6 1 1 1 1 1 1 1 1 1 1 1 1 1
symmnumber: 1
zpe: 484359.4 jmol-1
zpe.correction: 0.184483 hartree
zpe.thermalcorrener: 0.196222 hartree
zpe.thermalcorrenthalpy: 0.197166 hartree
zpe.thermalcorrgfe: 0.143909 hartree
zpe.sumelectzpe: -846.140331 hartree
zpe.sumelectthermal: -846.128592 hartree
zpe.sumelectthermalent: -846.127648 hartree
zpe.sumelectthermalfe: -846.180905 hartree
dipole: 0.5224 -3.6606 0.2573
dipole: 3.7067
quadrupole: -53.4115 -60.1180 -62.0881
quadrupole: 6.8723 3.3021 1.1949
quadrupole: 5.1277 -1.5788 -3.5489 6.8723 3.3021 1.1949
hfenergy: -846.3248138 hartree
pointgroup: C01 [X(C6H13Cl1O2)]
dipole: 0.0474062 -1.4574853 0.0135229 debye
dipolederiv: -0.1932864 -0.0492774 0.0059749 0.025924 -0.5656759 -0.0379174 0.0244009 0.0160861 -0.1858853 -1.112022 0.2665604 0.0286596 0.2535159 -0.4922274 0.0098925 0.0130773 -0.0209717 -0.4003284 -0.9134887 -0.3476681 -0.038207 -0.3850155 -0.7015622 -0.0508115 -0.0490484 -0.0183371 -0.4177738 0.5669485 -0.1926101 -0.1172924 -0.2678142 0.5221611 0.0158066 -0.2904232 0.0653896 0.3203794 0.406739 0.1303316 -0.0811015 0.2553629 0.6371323 -0.0015168 -0.2250088 -0.0825825 0.3035052 0.8152503 -0.1267023 0.0865089 0.0579357 0.2069041 -0.095944 0.2610554 -0.138965 0.2794037 0.7810204 0.1646193 0.058465 0.1091317 0.4252877 0.1019537 0.1783301 0.1716592 0.4019822 0.1141614 0.115769 0.0051969 0.051514 0.7458 -0.0004263 0.0111549 -0.0102121 0.1697226 -0.0179296 -0.0725421 0.0262683 -0.0833441 -0.0844071 0.0498789 0.0191818 0.0481815 0.041119 -0.0699351 -0.0998676 0.0081818 0.0102961 -0.2509029 -0.0298621 0.0639713 0.0023143 0.0561689 0.0249472 0.0319182 -0.0060697 0.0701557 0.0290907 0.0767869 0.0775358 -0.0041551 -0.1608328 -0.1040121 0.1434548 0.0246299 0.0206751 -0.2116809 -0.014549 0.0673881 -0.0325477 0.0546427 0.0514092 -0.0266394 0.0158936 -0.0726504 0.0053363 -0.043046 0.0685324 0.0556956 -0.1774075 -0.1176878 0.0112774 -0.0083166 -0.1617671 -0.2053802 -0.0283214 -0.0341364 -0.0107323 0.0614528 -0.0317438 0.0256109 0.0463251 -0.0015087 0.0637109 0.0706333 -0.0772328 0.0624136 -0.1626038 -0.0335546 -0.0356526 0.0822644 -0.0266321 0.0240685 -0.0202009 -0.0254748 -0.0633001 -0.2313053 -0.16653 0.063166 -0.0308383 0.1658156 -0.1526883 0.0171066 -0.034125 -0.0335845 0.0368668 -0.119166 -0.0279983 -0.0385669 -0.0240122 -0.0397801 -0.0025682 -0.0686476 -0.0074882 0.0886381 0.1212175 -0.0308196 -0.0245192 -0.0170185 -0.0404728 0.05283 0.0230225 0.0345132 -0.0721342 -0.108413 -0.100034 -0.0945776 -0.0886702 0.0526571 -0.0173592 -0.1133864 -0.0347618 0.0396111 0.0996638 0.0119904 0.045417 0.0099813 0.071705 -0.0567871 0.0826572 -0.0086823 -0.1380541 0.0064117 0.1451136 0.0057038 0.0981251 -0.0390762 0.0044216 0.0271755 0.0100675 0.0928326 unknown
polarizability: 91.3869353|4.2904846|89.8132565|-0.238772|0.1936303|64.1818363 unknown
InChI: InChI=1S/C6H13ClO2/c1-2-8-5-6-9-4-3-7/h2-6H2,1H3
charge 0 multiplicity 1
22 atoms
Cl -2.876468 2.099459 0.261879
O  -1.112839 -0.676101 0.331141
O  1.835081 -0.142786 -0.329777
C  -0.155517 -1.512844 -0.403348
C  1.21523 -1.341531 0.236247
C  -2.419751 -0.632392 -0.313074
C  3.060021 0.249287 0.380742
C  -3.328277 0.282878 0.489569
C  3.60269 1.504512 -0.301526
H  -0.475188 -2.578588 -0.354713
H  -0.100205 -1.205001 -1.469327
H  1.849345 -2.23303 0.026215
H  1.094054 -1.247752 1.337521
H  -2.880695 -1.650858 -0.325174
H  -2.336476 -0.28216 -1.364528
H  2.824048 0.448372 1.450117
H  3.804637 -0.579032 0.342715
H  -4.373665 0.199279 0.15579
H  -3.240877 0.084162 1.567791
H  4.52124 1.854009 0.204375
H  3.839766 1.298549 -1.359613
H  2.851445 2.311871 -0.266321
