program: Gaussian 09
title: 000170576
version: EM64L-G09RevD.01
frameworkgroup: C1[X(C8H12O3)]
method: RPBEPBE
basis: SDD
operation: Freq
keyword: #pfreq=noraman
keyword: PBEPBE/SDD
title: #p freq=noraman PBEPBE/SDD
converged: YES YES NO NO
title: Mulliken charges:
elementType: O O O C C C C C C C C H H H H H H H H H H H H
charge: -0.302029 -0.284997 -0.244763 0.384090 -0.424703 -0.331441 -0.740039 0.179185 0.340068 -0.755800 -0.627463 0.221840 0.221265 0.243643 0.247521 0.227019 0.231649 0.233626 0.237061 0.240373 0.217580 0.229954 0.256359
chargesum: 0.00000
title: Mulliken charges with hydrogens summed into heavy atoms:
elementType: O O O C C C C C C C C
charge: -0.302029 -0.284997 -0.244763 0.384090 0.018402 0.159724 -0.047745 0.179185 0.340068 -0.060785 -0.141150
polarizability: 1.29829229e+02 4.44419248e+00 8.81298590e+01 -3.99404458e+00 -2.79968143e+00 7.10869430e+01
1716.lowfreq: -6.8906 -0.0008 -0.0005 -0.0005 6.4095 12.9222 22.0167 40.3398 67.7769
frequency: 21.5589 40.2719 67.7585 87.0248 152.1478 181.9331 186.1987 210.0088 241.5662 331.5081 348.5678 370.5852 386.2680 394.0700 422.0138 524.8011 569.8470 632.3601 679.7052 760.3586 784.1783 810.0618 869.5465 908.2424 916.3461 951.1397 972.3134 991.6893 1008.2313 1016.9242 1051.9217 1053.4157 1079.0440 1109.4661 1131.9046 1172.9669 1281.2668 1295.3283 1355.1552 1379.8158 1395.5642 1396.6806 1415.8751 1457.3214 1460.0429 1463.7204 1471.9042 1476.9023 1488.8310 1611.2351 1653.8599 2988.9507 2990.2063 3015.6841 3064.6351 3072.3441 3082.2202 3085.7922 3097.6237 3101.8291 3104.2794 3169.1490 3216.4904
redmass: 3.4343 3.8133 4.3312 3.9797 2.8904 1.0689 1.1847 3.5577 5.5934 3.5119 2.4422 2.5512 2.6141 3.3887 2.9959 5.5093 3.9647 1.5416 5.0580 3.9962 2.0624 6.9592 3.8609 1.2501 3.4568 2.0077 1.7729 1.3160 1.3963 1.6111 1.4328 1.5021 1.6069 4.9381 1.2979 1.1659 2.1749 3.2040 1.8812 1.9648 1.2419 1.4007 1.2474 1.0459 1.0629 1.0600 1.0640 1.1295 1.2177 11.4887 5.1883 1.0361 1.0361 1.0579 1.0537 1.0971 1.1002 1.1056 1.1008 1.1000 1.0620 1.1189 1.1157
irintensity: 0.1643 0.5157 1.9864 0.0955 3.7864 0.4078 3.2386 8.2695 0.9913 13.7363 4.6456 6.3340 7.5134 0.5850 1.0574 6.3649 2.6679 10.1435 3.7486 21.3423 8.5316 11.0201 2.9359 0.8920 24.8618 5.6299 37.8612 58.6756 23.3882 15.2787 4.9163 6.4964 8.5747 442.9578 16.4284 2.1077 75.8639 27.6446 4.8239 12.8934 10.6313 40.4616 11.3907 18.4505 4.7954 19.3261 33.0305 10.0656 5.3415 147.6041 4.5283 17.1967 14.1573 11.7943 24.4421 16.5694 12.4892 21.4107 27.0516 22.8538 4.8722 27.1050 5.0986
temp: 298.150 k
press: 1.00000 atm
elementType: 8 8 8 6 6 6 6 6 6 6 6 1 1 1 1 1 1 1 1 1 1 1 1
symmnumber: 1
zpe: 484659.0 jmol-1
zpe.correction: 0.184597 hartree
zpe.thermalcorrener: 0.197113 hartree
zpe.thermalcorrenthalpy: 0.198057 hartree
zpe.thermalcorrgfe: 0.144419 hartree
zpe.sumelectzpe: -536.800615 hartree
zpe.sumelectthermal: -536.788099 hartree
zpe.sumelectthermalent: -536.787155 hartree
zpe.sumelectthermalfe: -536.840794 hartree
dipole: -1.2405 3.5817 -0.5444
dipole: 3.8293
quadrupole: -67.6043 -69.2084 -62.9114
quadrupole: 0.9964 -0.1561 0.1189
quadrupole: -1.0296 -2.6337 3.6633 0.9964 -0.1561 0.1189
hfenergy: -536.9852122 hartree
pointgroup: C01 [X(C8H12O3)]
dipole: 0.4427958 1.3902631 -0.3752786 debye
dipolederiv: -0.6424352 -0.1228933 0.0502941 -0.1499982 -0.4748537 0.091853 -0.0061498 0.0583933 -0.3923241 -1.7725313 0.1730678 -0.001237 0.1967281 -0.4908921 0.0542285 -0.0701141 0.0557663 -0.2714557 -0.684964 -0.0617542 0.0216072 0.1306198 -0.9108247 0.1546971 -0.0357849 0.1588642 -0.3529318 0.4048126 -0.0428787 -0.0140615 0.0070934 0.2497677 -0.1460158 0.0673327 -0.0595763 0.4175245 0.1454382 0.0249142 0.1315625 -0.0515824 0.2338157 0.0261616 0.0305813 -0.0356845 0.1410894 0.8647023 0.026263 -0.0799353 0.2583435 0.2275706 0.0731683 -0.0618145 0.0514168 0.218789 -0.0389368 0.0323654 -0.0165592 0.062235 0.0090084 0.0739887 -0.0084014 0.0922976 -0.1247244 1.9727051 -0.0513751 -0.0047667 -0.2379122 1.0161192 -0.1968314 0.0488379 -0.2057845 0.2725018 -0.4116616 -0.2045971 0.0616369 -0.1760067 0.2186597 -0.0733642 0.0477595 -0.0735565 -0.0331479 -0.0219778 0.0795363 -0.0184504 0.0721642 -0.1210213 0.0504185 -0.0110277 0.052961 0.0573229 0.0002696 0.1472349 -0.0409363 -0.0536945 -0.0841948 -0.0616764 0.0116619 -0.06485 -0.3086214 0.0826125 -0.0123818 -0.1037856 0.0208228 0.0362902 -0.0005369 -0.0969748 -0.036053 -0.0995638 0.0172824 0.0976034 -0.0433983 0.1004709 -0.0864106 -0.017475 -0.042015 0.0307412 0.0651935 -0.0491516 0.0183418 0.0385104 -0.0620959 -0.0213854 -0.0760095 0.0182522 -0.1015728 0.0058828 -0.0374102 -0.0018739 -0.0213896 -0.0539747 0.0654908 0.0252105 0.0106261 0.0572766 -0.0841386 0.114699 0.0158717 -0.0016149 -0.0110889 -0.0564473 -0.1283616 0.0195293 -0.0760723 -0.0239547 -0.0825333 0.1123308 -0.0469571 0.1096487 0.0439007 0.0268362 0.0012671 0.0053136 0.0750695 -0.0016332 -0.1090959 0.0592307 -0.1221397 0.0331948 0.0450428 0.07034 0.0116363 0.052522 0.0643467 0.0210324 -0.1199994 0.0269701 0.0674583 -0.0155669 -0.1198987 0.024518 -0.0463093 0.0663335 0.0741961 0.0911355 0.0772444 0.0379991 -0.0310392 0.0862989 -0.0702731 -0.0100785 -0.0986745 -0.1518386 0.0403822 -0.0699821 -0.0008791 0.0304158 0.0171141 0.0296254 0.1044235 -0.0148061 -0.0764648 0.0221528 -0.1072157 0.023218 0.0396764 0.0303185 0.0391322 0.1583422 0.1235138 0.012396 -0.003421 0.03335 -0.0155845 0.0551795 -0.0077387 0.0554804 0.1785891 unknown
polarizability: 129.9195076|-4.743698|87.2382316|-3.5648692|-4.1833682|71.8882913 unknown
InChI: InChI=1S/C8H12O3/c1-6(2)7(9)10-4-8(3)5-11-8/h1,4-5H2,2-3H3
charge 0 multiplicity 1
23 atoms
O  -3.477912 -0.596249 0.569496
O  0.170616 0.05377 -0.023265
O  1.549445 -1.764579 0.447114
C  -2.241167 -0.010293 -0.094142
C  -2.902947 0.724652 1.031782
C  -1.003844 -0.834376 0.214129
C  -2.421583 0.446286 -1.528286
C  1.426723 -0.556585 0.128706
C  2.536838 0.417454 -0.137268
C  2.189198 1.842602 -0.51384
C  3.810948 -0.049557 -0.022104
H  -2.45567 0.705993 2.033688
H  -3.524623 1.599049 0.803249
H  -0.923317 -1.717889 -0.445138
H  -0.996963 -1.180302 1.262367
H  -2.434525 -0.419199 -2.215294
H  -3.370977 0.99437 -1.648752
H  -1.587159 1.10833 -1.821715
H  1.585416 1.872171 -1.438821
H  1.581431 2.324119 0.272973
H  3.103792 2.439064 -0.670369
H  4.674561 0.599996 -0.200589
H  3.998219 -1.093028 0.25388
