program: Gaussian 09
title: 000170573
version: EM64L-G09RevD.01
frameworkgroup: C1[X(C6H13O5P)]
method: RPBEPBE
basis: SDD
operation: Freq
keyword: #p
keyword: freq=noraman
keyword: PBEPBE/SDD
title: #p freq=noraman PBEPBE/SDD
converged: YES YES NO NO
title: Mulliken charges:
elementType: P O O O O O C C C C C C H H H H H H H H H H H H H
charge: 1.298120 -0.536440 -0.504450 -0.592524 -0.208812 -0.187769 -0.215496 -0.228928 -0.028842 -0.652183 -0.656481 -0.507138 0.214785 0.243717 0.221205 0.247230 0.210653 0.232108 0.228402 0.206428 0.236194 0.228639 0.250363 0.251959 0.249258
chargesum: 0.00000
title: Mulliken charges with hydrogens summed into heavy atoms:
elementType: P O O O O O C C C C C C
charge: 1.298120 -0.536440 -0.504450 -0.592524 -0.208812 -0.187769 0.243006 0.239507 -0.028842 0.018980 0.014781 0.244442
polarizability: 1.23358043e+02 3.17872395e+00 1.13893365e+02 1.45479525e+00 6.74573806e+00 9.35308576e+01
1716.lowfreq: -12.8895 -0.0016 -0.0011 0.0006 2.5728 5.7201 10.6629 19.0987 37.7178
frequency: -10.2243 18.8003 37.7049 47.8478 73.7208 83.2025 96.5931 116.6751 138.6624 147.1896 205.7934 214.4323 234.0686 243.1497 258.1771 277.8276 295.5737 308.9991 371.6367 430.5393 493.9694 591.1880 625.7839 684.4477 746.6010 806.4016 810.3601 869.1299 873.0568 881.9655 1012.6519 1019.8626 1046.0851 1101.3904 1104.1951 1104.9712 1112.2147 1133.9847 1134.6491 1146.6348 1252.5345 1254.4253 1353.4093 1355.6832 1393.4216 1394.0693 1415.5167 1455.4453 1456.1635 1457.3349 1457.6289 1477.7330 1479.9298 1490.3808 1494.7666 1632.3034 2991.0940 2992.9838 2995.3353 3002.2818 3014.1775 3056.5824 3069.0173 3090.3906 3090.4950 3109.0706 3111.0019 3122.1828 3168.2774
redmass: 2.2440 6.3499 2.4038 2.9403 2.6187 2.4808 1.1691 4.5022 5.1405 4.8927 5.8500 2.6452 1.3055 1.6000 4.8577 3.1317 4.4615 5.7391 5.2921 6.6014 11.3775 8.3659 6.7612 6.7900 6.1537 1.0919 1.0914 4.0731 4.5314 7.4726 2.5490 2.6068 13.0342 2.4247 1.7579 1.5384 4.6686 1.4210 1.4450 1.5230 1.1454 1.1437 1.2549 1.2435 1.2425 1.2463 1.1716 1.0504 1.0400 1.0503 1.0409 1.0499 1.0478 1.0820 1.0867 10.3054 1.0487 1.0363 1.0444 1.0575 1.0291 1.1078 1.1068 1.0978 1.0980 1.1023 1.1026 1.1056 1.1053
irintensity: 0.3210 2.4599 0.7569 1.5313 3.6248 4.0292 0.1064 1.0338 1.2927 1.3250 16.7704 3.3419 1.2515 6.7685 24.4974 7.9387 6.2810 14.7205 12.3811 11.8319 73.4885 21.7736 61.3985 110.5746 6.3762 4.6816 2.1221 100.5726 192.0595 66.6288 146.1831 131.5975 79.3834 58.7561 15.8479 13.0829 164.7285 6.1546 7.0500 42.8767 0.3939 1.4480 5.2371 3.3273 18.2633 30.4158 14.5309 17.6438 11.2881 16.5588 8.5122 6.4367 4.7177 14.6924 4.0364 187.7037 25.6700 21.4436 29.3931 25.4789 20.7872 10.0285 5.1296 16.3521 41.0710 34.3298 37.0283 18.6369 8.3483
temp: 298.150 k
press: 1.00000 atm
elementType: 15 8 8 8 8 8 6 6 6 6 6 6 1 1 1 1 1 1 1 1 1 1 1 1 1
symmnumber: 1
zpe: 505624.2 jmol-1
zpe.correction: 0.192582 hartree
zpe.thermalcorrener: 0.208260 hartree
zpe.thermalcorrenthalpy: 0.209204 hartree
zpe.thermalcorrgfe: 0.147342 hartree
zpe.sumelectzpe: -952.763112 hartree
zpe.sumelectthermal: -952.747435 hartree
zpe.sumelectthermalent: -952.746490 hartree
zpe.sumelectthermalfe: -952.808352 hartree
dipole: 0.9219 0.8745 -3.8401
dipole: 4.0449
quadrupole: -58.9539 -73.9863 -90.8048
quadrupole: -2.8811 0.3594 -1.4209
quadrupole: 15.6278 0.5954 -16.2232 -2.8811 0.3594 -1.4209
hfenergy: -952.9556944 hartree
pointgroup: C01 [X(C6H13O5P1)]
dipole: -0.0623643 0.4524199 1.5244287 debye
dipolederiv: 1.8632736 0.0024344 0.1223109 -0.0165846 2.0655573 -0.1503272 0.341961 0.2082904 1.3258693 -1.3484278 -0.5299555 -0.1209866 -0.5282893 -0.9136963 -0.0535391 -0.1584027 -0.1461272 -0.5414284 -0.6579783 0.2467095 -0.1072194 0.24327 -1.3374839 0.3131094 -0.1695579 0.517038 -0.6763546 -0.7164425 -0.005574 0.0310635 -0.0021517 -0.6219019 0.0419514 -0.0277535 -0.0077938 -0.6883994 -1.0822436 0.5348081 0.1461491 0.6815997 -0.9210551 0.0125827 0.1276799 0.049851 -0.3320258 -0.6683797 -0.1103287 0.2945998 0.1224601 -0.7245775 0.2005768 0.1905368 0.3890667 -0.5144392 0.865093 0.3951945 0.0835972 0.3386654 0.5397138 0.0501958 -0.2204666 -0.144719 0.1796266 0.3561632 -0.1438979 0.0923457 -0.0821185 0.6016079 -0.1807969 0.2094693 -0.6176561 0.4572867 1.0451852 -0.2739618 -0.4042961 -0.5935953 1.0772335 -0.2747349 -0.2190983 -0.5189896 0.3723306 -0.0698519 -0.1114101 -0.0565949 -0.0877027 -0.0519495 -0.0927705 -0.0097933 -0.0571883 0.0000373 0.0117873 0.1009762 0.0005242 0.0885465 -0.1396884 -0.0054761 -0.0340479 0.0869396 0.0418122 0.545475 -0.1641548 -0.0480126 -0.1048741 0.2942322 0.056392 -0.1177047 0.1091045 0.2852123 -0.1385918 0.0197554 0.0311382 0.0791004 -0.0845285 -0.0654003 0.0582034 -0.0211409 0.0530271 0.0175549 -0.0076273 -0.0712607 -0.0287987 0.0153749 0.0435052 0.0248014 0.0976519 -0.0537687 -0.0145878 -0.035969 -0.0870526 -0.0638163 -0.0338389 -0.0722932 -0.0784024 0.0228884 -0.0279008 -0.0434036 -0.0157764 0.09329 0.0042425 0.0405224 0.0243758 0.0364278 0.0806654 -0.0157968 -0.0939221 -0.1299864 0.0432326 -0.1308839 0.0278313 0.005112 0.0461017 0.0106879 0.066027 0.0009987 0.1470089 0.0394181 0.1038123 -0.0053282 -0.0383342 0.0029277 -0.0410024 0.073614 0.111576 0.0305732 -0.0231215 0.0384297 0.0307269 0.1182097 -0.0564702 0.0635931 -0.0773187 0.0879997 0.0645745 -0.039538 0.0579783 -0.0259954 0.0953402 -0.0482824 0.1181542 -0.0772769 0.0042734 -0.0958189 -0.0834639 -0.0594925 0.0323285 -0.0624848 -0.0613671 -0.1109991 0.0375333 -0.0735615 -0.0087445 0.0988735 -0.0516157 0.0854339 0.0278668 0.1190543 -0.0271135 0.0448466 -0.0030034 0.0407261 -0.0508913 0.011707 0.1001892 0.0133015 0.0284856 -0.0546966 -0.0913859 -0.050306 -0.0027087 0.0014646 -0.1071726 -0.0117405 -0.0540865 0.0171049 -0.0719719 0.0706584 0.0513201 0.053153 0.0144304 0.0872839 -0.0389674 0.0477244 -0.0014068 0.0654674 0.0882138 unknown
polarizability: 117.7800405|-5.907336|119.4380142|-3.4857796|-5.7638865|93.5642108 unknown
InChI: InChI=1S/C6H13O5P/c1-4-10-12(8,11-5-2)6(7)9-3/h4-5H2,1-3H3
charge 0 multiplicity 1
25 atoms
P  0.097265 -0.044298 -0.617864
O  1.138823 0.747111 0.537782
O  0.494891 -1.724307 -0.55884
O  0.131839 0.525876 -2.098843
O  -2.15787 1.267789 0.114171
O  -1.937276 -0.79241 1.194307
C  2.369771 1.431186 0.029866
C  0.817513 -2.410242 0.735363
C  -1.532275 0.081541 0.406071
C  2.819522 2.382442 1.134618
C  1.464031 -3.73836 0.354557
C  -3.453636 1.519854 0.812945
H  3.135179 0.661979 -0.186967
H  2.122068 1.964407 -0.906829
H  1.500477 -1.768244 1.32322
H  -0.123927 -2.549146 1.295831
H  3.746281 2.901784 0.827106
H  2.043156 3.139548 1.336153
H  3.022229 1.830818 2.068501
H  1.708334 -4.311137 1.268846
H  0.775661 -4.341015 -0.261632
H  2.392127 -3.574558 -0.218823
H  -3.289064 1.548078 1.902474
H  -4.172168 0.722828 0.561425
H  -3.783954 2.493976 0.430363
