program: Gaussian 09
title: 000170565
version: EM64L-G09RevD.01
frameworkgroup: C1[X(C3H3BrO2)]
method: RPBEPBE
basis: SDD
operation: Freq
keyword: #p
keyword: freq=noraman
keyword: PBEPBE/SDD
title: #p freq=noraman PBEPBE/SDD
converged: YES YES YES YES
title: Mulliken charges:
elementType: Br O O C C C H H H
charge: 0.038056 -0.358706 -0.184725 -0.167515 -0.054437 -0.068631 0.264673 0.169711 0.361574
chargesum: 0.00000
title: Mulliken charges with hydrogens summed into heavy atoms:
elementType: Br O O C C C
charge: 0.038056 0.002868 -0.184725 -0.167515 0.210236 0.101081
polarizability: 7.69897857e+01 4.05411895e+00 6.95103027e+01 1.00461539e-05 -1.35480161e-04 1.96259614e+01
1716.lowfreq: -4.9032 -0.0010 -0.0004 -0.0003 7.4277 8.3193 139.6805 164.8886 179.9034
frequency: 139.6782 164.8886 179.9034 323.9515 400.6440 460.8593 484.8148 623.6493 649.2067 871.5813 948.6295 1092.4116 1169.2412 1241.8662 1338.7604 1382.4616 1601.3221 1608.6549 2861.1436 3174.6219 3424.9596
redmass: 5.3204 14.9966 7.6578 2.2107 2.4559 6.2814 6.8696 1.4691 5.3817 1.2889 1.6956 2.6548 6.6053 1.5379 1.3271 1.1903 7.5092 7.5587 1.0832 1.0919 1.0643
irintensity: 4.7835 4.5384 5.2885 17.1979 0.2964 21.6972 27.6715 137.1057 1.8117 46.5254 8.8065 331.5446 4.8751 40.0604 2.2089 15.2608 73.2938 442.1148 85.6994 3.5197 40.7304
temp: 298.150 k
press: 1.00000 atm
elementType: 35 8 8 6 6 6 1 1 1
symmnumber: 1
zpe: 144408.7 jmol-1
zpe.correction: 0.055002 hartree
zpe.thermalcorrener: 0.061367 hartree
zpe.thermalcorrenthalpy: 0.062311 hartree
zpe.thermalcorrgfe: 0.023393 hartree
zpe.sumelectzpe: -279.529775 hartree
zpe.sumelectthermal: -279.523410 hartree
zpe.sumelectthermalent: -279.522466 hartree
zpe.sumelectthermalfe: -279.561384 hartree
dipole: 3.1969 1.5629 0.0000
dipole: 3.5584
quadrupole: -53.8063 -36.9019 -45.0855
quadrupole: -3.8268 0.0001 0.0000
quadrupole: -8.5417 8.3627 0.1791 -3.8268 0.0001 0.0000
hfenergy: -279.5847773 hartree
pointgroup: C01 [X(C3H3Br1O2)]
dipole: 1.3276568 -0.444219 -0.0000626 debye
dipolederiv: -0.1042189 -0.0532039 0.0000252 -0.0059133 -0.513892 0.0000953 0.000018 0.0001038 0.028296 -1.3701276 -0.0111412 0.0001117 -0.5382995 -0.1956799 0.0000261 0.0002136 -0.0000349 -0.3894764 -1.0947858 -0.0577782 0.0001015 0.2492959 -0.2944882 -0.0000378 0.0000199 -0.0000004 -0.3282846 -1.123864 -0.0902282 0.0001147 -0.0065098 0.7773393 -0.0001788 0.0001014 -0.0001675 -0.2219682 1.5094719 -0.1483522 -0.0001434 0.2079045 -0.0175858 -0.0000135 -0.0002112 0.0000306 0.0418599 1.6281799 0.2427754 -0.0002063 0.0630474 0.3583012 -0.0000268 -0.0001555 -0.0000474 0.1643149 0.093223 0.0188817 0.0000093 -0.0487874 -0.0026729 0.0000415 0.0000236 0.0000322 0.2021609 0.0260859 0.0530529 0.0000019 -0.0050586 -0.2764869 0.0000635 0.0000109 0.0000501 0.1210835 0.4360357 0.0459937 -0.0000147 0.0843207 0.1651651 0.0000304 -0.0000207 0.0000336 0.3820139 unknown
polarizability: 77.9171016|-2.9394084|68.5829847|-0.0057687|-0.0083453|19.6259635 unknown
InChI: InChI=1S/C3H3BrO2/c4-3(1-5)2-6/h1-2,5H
charge 0 multiplicity 1
9 atoms
Br 0.036674 1.90608 -0.000282
O  2.449235 -0.195268 -0.000188
O  -2.431077 -0.191779 0.000333
C  -0.000371 -0.051715 0.000074
C  1.191557 -0.738061 0.00006
C  -1.297682 -0.736167 0.000339
H  1.22018 -1.831807 0.000248
H  -1.187226 -1.851921 0.00048
H  2.402411 0.803038 -0.000364
