program: Gaussian 09
title: 000170578
version: EM64L-G09RevD.01
frameworkgroup: C1[X(C16H14O4)]
method: RPBEPBE
basis: SDD
operation: Freq
keyword: #pfreq=noraman
keyword: PBEPBE/SDD
title: #p freq=noraman PBEPBE/SDD
converged: YES YES NO NO
title: Mulliken charges:
elementType: O O O O C C C C C C C C C C C C C C C C H H H H H H H H H H H H H H
charge: -0.287187 -0.262778 -0.434331 -0.181830 0.240529 0.237622 0.047386 0.197049 0.220031 0.171865 -0.694830 -0.698935 -0.424064 -0.337251 -0.387083 -0.219444 0.125447 -0.356773 -0.238109 -0.216872 0.255502 0.246589 0.225362 0.231727 0.248720 0.236754 0.242871 0.244940 0.240473 0.227400 0.257040 0.227313 0.231079 0.383789
chargesum: 0.00000
title: Mulliken charges with hydrogens summed into heavy atoms:
elementType: O O O O C C C C C C C C C C C C C C C C
charge: -0.287187 -0.262778 -0.050542 -0.181830 0.240529 0.237622 0.047386 0.197049 0.220031 0.171865 0.032624 0.018266 -0.181193 -0.092311 -0.146610 0.007956 0.125447 -0.099733 -0.010796 0.014207
polarizability: 2.58243707e+02 2.11970584e+01 2.08927789e+02 -7.97239713e+00 2.35189524e+00 1.03348643e+02
1716.lowfreq: -6.2201 -4.4456 -0.0005 -0.0003 -0.0003 3.2178 18.6253 40.0275 50.9844
frequency: 18.5357 40.0162 50.9708 58.0784 110.3598 132.3454 161.8142 184.4087 220.7178 241.8192 253.3559 274.9019 284.8822 291.6083 315.1222 325.3190 336.0179 391.8839 430.4847 440.3758 454.2751 521.7335 537.5249 553.0240 558.9641 566.3488 576.0930 580.4089 620.6740 642.0795 682.3027 706.3909 721.7117 729.9681 751.4001 761.1498 794.2033 804.9381 815.8078 825.7225 863.0387 896.5511 915.6302 930.7442 937.6962 942.4983 966.7095 979.7170 1002.2732 1010.1826 1013.9874 1051.9968 1064.6515 1115.9343 1147.8304 1159.9661 1169.3416 1173.4846 1175.0893 1188.7013 1202.6097 1233.4016 1259.8432 1293.7671 1312.6643 1371.4111 1389.5849 1391.4023 1393.1179 1416.8010 1438.7407 1458.5959 1460.2852 1463.1824 1476.9504 1480.9762 1485.0694 1585.6614 1600.8974 1605.1776 1636.4429 1686.2831 2995.8006 3002.3116 3097.1597 3101.7639 3110.4638 3122.5738 3134.5792 3138.2396 3147.1618 3156.0831 3163.2564 3171.3687 3177.8096 3520.5926
redmass: 4.8616 8.4641 4.9319 5.5229 5.2563 4.4689 5.1005 6.0232 1.7546 4.2693 1.4221 3.8235 1.0814 4.6398 3.8957 4.1936 3.4124 4.3805 3.4791 4.9018 5.4877 5.1250 4.2960 4.2083 4.4097 5.3278 1.2510 4.4577 5.9737 6.2372 5.4743 5.3799 5.3786 2.7251 2.5162 1.3513 3.5043 2.3481 6.2949 4.7310 1.4174 1.4373 3.6164 1.5941 2.8841 1.3910 1.3291 1.3104 1.3018 2.1446 2.9858 2.1254 4.1826 1.7263 2.5319 1.6956 2.3274 1.5043 2.2795 2.0240 1.8315 2.0896 1.8226 2.5570 2.0832 1.1966 5.1386 3.0166 1.2783 4.1130 2.9645 1.0520 2.4700 1.1177 1.1286 2.5244 1.0991 7.5017 7.9868 7.2325 8.5500 9.7037 1.0346 1.0356 1.1009 1.0992 1.0999 1.1012 1.0858 1.0863 1.0910 1.0927 1.0962 1.0983 1.0987 1.0642
irintensity: 0.2551 0.9484 1.0542 1.4717 2.0810 0.9097 2.5460 0.0886 0.0050 0.7134 0.1315 0.2246 0.2217 0.1137 4.5617 2.4646 1.1232 2.2355 3.2308 5.2800 1.7363 11.0770 4.3181 1.1356 16.9752 3.3074 116.4440 19.3761 5.7338 7.5783 1.2295 12.0459 24.2388 4.3068 4.6036 143.3528 4.3441 28.4582 22.2546 8.2508 0.1627 0.5303 4.4397 6.6592 50.7328 3.2925 2.6492 0.0043 1.2630 50.3681 349.3283 25.3673 120.4794 6.1808 163.4772 28.2555 1.9147 3.7459 43.9286 12.7880 37.1711 36.4008 8.2918 12.8744 23.8366 24.1618 13.3827 14.7228 12.7193 19.5356 60.6193 3.0824 7.5725 3.2268 15.5242 11.1084 39.1071 27.0727 17.2978 5.3077 11.2632 222.4445 9.8377 8.8128 13.2727 24.7812 15.7923 13.1033 1.0364 4.7329 9.2108 12.5978 25.3766 15.2488 12.2872 27.7894
temp: 298.150 k
press: 1.00000 atm
elementType: 8 8 8 8 6 6 6 6 6 6 6 6 6 6 6 6 6 6 6 6 1 1 1 1 1 1 1 1 1 1 1 1 1 1
symmnumber: 1
zpe: 682803.3 jmol-1
zpe.correction: 0.260066 hartree
zpe.thermalcorrener: 0.277400 hartree
zpe.thermalcorrenthalpy: 0.278344 hartree
zpe.thermalcorrgfe: 0.214020 hartree
zpe.sumelectzpe: -917.576225 hartree
zpe.sumelectthermal: -917.558891 hartree
zpe.sumelectthermalent: -917.557947 hartree
zpe.sumelectthermalfe: -917.622271 hartree
dipole: -0.8451 0.7554 3.3598
dipole: 3.5458
quadrupole: -94.3069 -100.2341 -127.0340
quadrupole: -1.0434 6.5334 -0.8585
quadrupole: 12.8848 6.9575 -19.8423 -1.0434 6.5334 -0.8585
hfenergy: -917.8362907 hartree
pointgroup: C01 [X(C16H14O4)]
dipole: 0.3548981 0.264592 -1.322938 debye
polarizability: 259.4155287|-20.1698156|207.7544386|-3.8831651|-6.1239176|103.3501719 unknown
InChI: InChI=1S/C16H14O4/c1-16(2,15(17)18)20-13-9-5-7-11-10-6-3-4-8-12(10)19-14(11)13/h3-9,17H,1-2H3
charge 0 multiplicity 1
34 atoms
O  -1.987989 0.280535 0.660954
O  0.718667 -0.928558 0.335033
O  -4.723684 -1.760725 -0.611021
O  -3.975925 -1.310854 1.540854
C  -2.831289 -0.280234 -0.442108
C  1.615686 1.217474 0.003509
C  0.430105 0.454011 0.218598
C  2.716328 0.25425 -0.016143
C  -0.851156 1.035623 0.313363
C  2.128631 -1.02746 0.190472
C  -1.998011 -1.159856 -1.40025
C  -3.563814 0.856191 -1.194836
C  1.526216 2.622779 -0.124308
C  -0.914401 2.445606 0.196189
C  4.117914 0.342495 -0.182709
C  0.253007 3.223771 -0.023224
C  -3.858038 -1.143226 0.315992
C  2.858436 -2.221195 0.241868
C  4.878949 -0.846629 -0.136713
C  4.258934 -2.10983 0.072709
H  -1.450682 -1.936004 -0.841597
H  -2.661441 -1.638811 -2.138669
H  -1.263514 -0.534218 -1.937188
H  -4.135079 1.484767 -0.490119
H  -4.259591 0.430202 -1.936285
H  -2.828582 1.488973 -1.721931
H  2.420845 3.232222 -0.286705
H  -1.889801 2.928942 0.311224
H  4.606878 1.309296 -0.342531
H  0.157266 4.311727 -0.103302
H  2.368114 -3.184045 0.408324
H  5.965844 -0.798831 -0.262456
H  4.875786 -3.014244 0.106007
H  -5.384709 -2.312245 -0.111799
