program: Gaussian 09
title: 000170603
version: EM64L-G09RevD.01
frameworkgroup: C1[X(C10H13ClN7OP)]
method: RPBEPBE
basis: SDD
operation: Freq
keyword: #p
keyword: freq=noraman
keyword: PBEPBE/SDD
title: #p freq=noraman PBEPBE/SDD
converged: YES YES NO NO
title: Mulliken charges:
elementType: Cl P O N N N N N N N C C C C C C C C C C H H H H H H H H H H H H H
charge: -0.017152 1.284512 -0.615825 -0.418495 -0.435191 -0.799580 -0.159614 -0.004755 -0.025606 0.142074 -0.392919 -0.365301 -0.362907 -0.387184 0.296881 0.141678 -0.084296 -0.225363 -0.379356 -0.639271 0.251894 0.256762 0.283045 0.253859 0.245594 0.257879 0.249083 0.263722 0.365669 0.268051 0.245676 0.258126 0.248309
chargesum: 0.00000
title: Mulliken charges with hydrogens summed into heavy atoms:
elementType: Cl P O N N N N N N N C C C C C C C C C C
charge: -0.017152 1.284512 -0.615825 -0.418495 -0.435191 -0.433910 -0.159614 -0.004755 -0.025606 0.142074 0.115737 0.171603 0.140567 0.125620 0.296881 0.141678 -0.084296 0.042688 -0.379356 0.112840
polarizability: 2.34655871e+02 8.08987617e+00 2.11812765e+02 1.67605415e+00 4.34359406e-01 1.32921827e+02
1716.lowfreq: -7.1373 -0.0012 -0.0011 0.0003 3.6305 6.5285 27.2213 35.4028 42.9385
frequency: 27.1779 35.2945 42.8980 57.3955 65.0657 68.5771 94.5959 132.8208 137.9090 165.0407 173.9169 181.7876 195.2186 210.2424 229.3357 236.4267 244.4780 295.9059 320.0966 340.6010 361.0939 369.2625 381.1114 444.2834 465.4658 515.0279 529.7736 539.4908 594.1847 609.6112 626.8289 652.1854 676.7613 728.5894 753.3807 767.0354 788.4471 789.6872 793.2069 795.4391 801.8312 835.5276 878.0185 888.4887 892.7676 987.5142 995.1931 1016.0453 1023.9781 1045.0050 1067.8342 1074.0672 1079.1631 1099.8995 1106.7474 1116.7440 1119.0742 1124.7437 1148.0370 1148.2564 1191.7727 1231.5715 1243.1738 1246.4048 1284.0335 1303.1549 1335.0513 1367.6317 1378.6424 1383.5995 1424.3706 1447.3901 1460.2587 1460.4332 1463.1007 1473.6214 1476.3423 1492.0443 1512.3433 1591.7818 2988.9175 3076.6999 3080.6613 3085.1978 3087.6070 3102.2407 3109.6436 3184.3164 3193.8952 3201.0154 3216.2036 3225.7378 3551.3763
redmass: 5.1836 3.8091 3.5555 7.1895 5.0424 3.0268 4.2603 3.9292 4.3585 1.4608 4.0745 2.7782 4.4064 5.4494 4.2478 7.7321 6.6299 6.1142 4.4681 5.3536 5.2345 8.1864 7.8228 6.9346 6.2893 1.5755 8.2001 4.6204 4.3108 4.5747 7.7299 10.9174 10.1494 9.4405 7.4308 8.9121 7.7250 6.2986 1.2154 1.1409 4.7971 1.5242 4.5821 9.2080 5.1839 1.0539 1.1255 3.8699 4.0789 3.7548 2.1445 1.4402 1.4432 1.3460 1.3054 1.3105 1.3121 1.2953 1.4140 1.4056 3.1311 1.9876 3.2023 3.3102 3.1016 5.7472 5.0448 4.1235 6.4884 3.8421 2.0925 1.0770 1.6637 1.1155 1.1755 1.1669 1.0424 1.0625 7.7135 8.6888 1.0351 1.1035 1.0486 1.0529 1.0612 1.0564 1.0991 1.1181 1.1183 1.1170 1.1182 1.0987 1.0766
irintensity: 0.4138 3.9120 2.0656 6.3892 2.6466 4.4074 2.8465 2.5194 0.8656 0.2033 0.3862 2.6680 4.1352 13.1988 0.3996 0.6570 0.6563 1.9729 0.8581 8.8667 12.2996 1.8400 3.0043 35.4735 25.6817 22.4113 4.2989 16.9100 11.7380 159.5968 42.1587 4.2060 5.7959 41.9398 91.2487 20.1728 1.8275 0.9799 31.8396 16.5586 5.3241 21.5620 118.0497 102.3815 217.8535 0.7345 3.1360 40.6551 121.1087 24.7063 48.1644 18.3416 4.7721 0.8106 8.9945 9.7676 0.3350 8.6968 0.1961 0.8683 37.1336 142.7054 61.9241 66.2348 48.8380 100.0219 1.1121 50.8212 104.6207 84.3696 16.7265 6.9075 113.0722 11.1172 1.6155 8.8672 18.4492 54.0327 224.5992 475.2736 31.4158 13.5695 16.1393 19.2565 23.9417 10.4775 10.7972 0.5777 4.1353 15.0219 6.7520 0.9144 43.8045
temp: 298.150 k
press: 1.00000 atm
elementType: 17 15 8 7 7 7 7 7 7 7 6 6 6 6 6 6 6 6 6 6 1 1 1 1 1 1 1 1 1 1 1 1 1
symmnumber: 1
zpe: 626573.0 jmol-1
zpe.correction: 0.238649 hartree
zpe.thermalcorrener: 0.258599 hartree
zpe.thermalcorrenthalpy: 0.259543 hartree
zpe.thermalcorrgfe: 0.188384 hartree
zpe.sumelectzpe: -1647.043193 hartree
zpe.sumelectthermal: -1647.023243 hartree
zpe.sumelectthermalent: -1647.022299 hartree
zpe.sumelectthermalfe: -1647.093458 hartree
dipole: 0.4275 -5.1786 1.4799
dipole: 5.4028
quadrupole: -138.9232 -133.3997 -124.0285
quadrupole: 36.7635 4.3694 -4.1695
quadrupole: -6.8061 -1.2825 8.0886 36.7635 4.3694 -4.1695
hfenergy: -1647.2818424 hartree
pointgroup: C01 [X(C10H13Cl1N7O1P1)]
dipole: 0.1894438 -1.721854 1.2319276 debye
polarizability: 234.5444331|5.5723173|202.4439627|-7.7652481|-25.2727874|142.4020663 unknown
InChI: InChI=1S/C10H13ClN7OP/c1-16-6-12-8-7(16)9(14-10(11)13-8)15-20(19,17-2-3-17)18-4-5-18/h6,15H,2-5H2,1H3
charge 0 multiplicity 1
33 atoms
Cl -0.277421 3.412154 -1.113533
P  2.29329 -1.202214 -0.041686
O  2.928949 -2.599953 0.395116
N  2.296534 -0.886343 -1.780535
N  3.028306 0.219711 0.750301
N  0.54742 -1.313897 0.356936
N  -2.660674 -1.665399 0.587265
N  -0.013992 0.864395 -0.316294
N  -4.057676 0.103927 0.11723
N  -2.289281 1.735568 -0.472707
C  3.609039 -0.465073 -2.428081
C  2.460052 0.517742 -2.335018
C  2.397146 0.956783 1.904263
C  3.616715 0.083458 2.140478
C  -0.432508 -0.372064 0.091313
C  -1.832787 -0.589917 0.22672
C  -2.725022 0.50049 -0.064586
C  -3.971713 -1.181174 0.500121
C  -0.956428 1.810056 -0.56762
C  -2.26942 -3.032836 0.955324
H  3.821436 -0.990015 -3.363713
H  4.47219 -0.289834 -1.774654
H  2.545149 1.337066 -1.614907
H  1.827864 0.710261 -3.206501
H  1.430686 0.595737 2.275742
H  2.493645 2.044778 1.848614
H  4.605642 0.539167 2.248823
H  3.482755 -0.874417 2.657141
H  0.278142 -2.254215 0.655821
H  -4.826962 -1.815686 0.7279
H  -3.179591 -3.619322 1.158274
H  -1.72375 -3.525798 0.131257
H  -1.650835 -3.039236 1.870597
