program: Gaussian 09
title: 000170561
version: EM64L-G09RevD.01
frameworkgroup: C1[X(C8H9NO5S)]
method: RPBEPBE
basis: SDD
operation: Freq
keyword: #p
keyword: freq=noraman
keyword: PBEPBE/SDD
title: #p freq=noraman PBEPBE/SDD
converged: YES YES NO NO
title: Mulliken charges:
elementType: S O O O O O N C C C C C C C C H H H H H H H H H
charge: 0.901562 -0.526000 -0.558110 -0.428246 -0.191564 -0.184489 0.025453 -0.578443 -0.037442 -0.287197 -0.361958 -0.255800 0.393926 -0.169793 -0.346646 0.260625 0.319766 0.212179 0.243821 0.338854 0.300343 0.257481 0.297791 0.373889
chargesum: 0.00000
title: Mulliken charges with hydrogens summed into heavy atoms:
elementType: S O O O O O N C C C C C C C C
charge: 0.901562 -0.526000 -0.558110 -0.054357 -0.191564 -0.184489 0.025453 0.001948 -0.037442 0.168803 -0.023104 0.044542 0.393926 0.087689 -0.048855
polarizability: 1.79227905e+02 3.19156331e-01 1.49414512e+02 4.54576500e+00 1.01454808e+01 8.63943700e+01
1716.lowfreq: -12.5956 -3.8741 -0.0011 0.0007 0.0015 8.0343 26.1316 30.3692 52.8543
frequency: 25.5420 30.2721 52.8411 87.5126 102.8436 161.3159 178.6628 189.5698 208.7567 217.0815 239.6378 272.1932 327.8134 351.1974 390.0464 396.9480 425.4894 450.1575 493.2743 515.4182 547.6497 635.5494 663.4947 668.4553 686.9892 702.9547 762.3721 801.3263 822.1072 835.5093 899.3843 921.2951 941.3921 960.4853 980.3705 1003.1236 1009.3427 1031.0251 1052.7102 1081.0159 1098.8534 1139.9301 1171.1432 1179.1821 1212.3590 1257.3866 1266.2642 1347.4590 1377.3451 1384.8476 1401.1523 1403.2793 1424.9479 1445.7711 1451.4136 1584.7558 1600.3581 2949.6650 3037.8176 3047.4567 3137.8061 3150.6538 3167.5546 3169.1809 3188.2918 3353.8422
redmass: 5.7970 7.8569 10.6568 3.9439 10.1525 5.1027 5.5872 4.6704 5.6108 8.9871 7.2833 3.7651 6.7819 4.8104 9.7193 8.2555 3.1555 3.3198 4.0054 6.7862 5.5589 6.8370 1.1724 3.4648 6.7723 3.9586 11.6674 9.3749 1.4265 2.2520 2.6126 3.7125 1.4201 1.3951 5.2874 1.9787 1.3661 3.2215 1.9762 1.9712 2.4240 1.2403 1.1278 1.1427 9.8009 1.2263 1.3261 1.2447 8.4738 1.1071 2.3384 1.8193 2.9941 2.2716 1.1015 6.8947 7.6689 1.0677 1.0648 1.0849 1.1099 1.0895 1.0927 1.0932 1.0974 1.0661
irintensity: 3.1611 0.5473 1.8259 4.9677 3.6840 1.0468 5.4612 2.8517 0.6099 7.1794 9.9511 9.2481 23.6654 7.1067 25.3939 9.6326 2.0921 13.6114 3.4051 0.5800 53.8788 3.5020 150.9281 16.2555 5.3071 28.6118 55.3211 20.5969 35.3527 11.2609 52.4581 97.1831 9.0131 3.9900 3.1655 34.0170 1.4682 79.8887 30.3905 21.3923 15.4909 2.7895 16.8670 37.3717 223.8518 5.9324 0.1257 4.4812 73.9935 15.5987 23.8354 83.1073 45.6637 20.2009 11.3037 1.3138 2.8641 54.1234 7.6524 9.9719 1.5838 4.3436 7.3727 15.1275 2.3491 90.7305
temp: 298.150 k
press: 1.00000 atm
elementType: 16 8 8 8 8 8 7 6 6 6 6 6 6 6 6 1 1 1 1 1 1 1 1 1
symmnumber: 1
zpe: 437066.7 jmol-1
zpe.correction: 0.166470 hartree
zpe.thermalcorrener: 0.181298 hartree
zpe.thermalcorrenthalpy: 0.182242 hartree
zpe.thermalcorrgfe: 0.122731 hartree
zpe.sumelectzpe: -1137.798996 hartree
zpe.sumelectthermal: -1137.784167 hartree
zpe.sumelectthermalent: -1137.783223 hartree
zpe.sumelectthermalfe: -1137.842735 hartree
dipole: 1.4200 4.3560 5.1960
dipole: 6.9275
quadrupole: -114.8060 -102.7877 -94.9456
quadrupole: 9.8389 -7.6343 3.5886
quadrupole: -10.6263 1.3921 9.2342 9.8389 -7.6343 3.5886
hfenergy: -1137.9654654 hartree
pointgroup: C01 [X(C8H9N1O5S1)]
dipole: -0.703642 1.8401402 -1.8833389 debye
dipolederiv: 1.6767333 -0.0007183 0.0653422 -0.104065 1.1027593 0.0615692 0.1270131 -0.000522 1.0970022 -0.677886 -0.0498424 -0.0176805 -0.0209954 -0.6412873 -0.1608296 0.0235594 -0.0551167 -0.5217109 -0.7201566 0.1034008 0.0214872 0.1945568 -0.6793155 0.0880134 -0.0269513 0.0123014 -0.5867051 -0.5278304 0.0677671 -0.1195335 0.0808598 -0.6508763 0.0516968 -0.1656828 0.0550738 -0.4452568 -0.8770148 -0.0249531 -0.0686783 -0.1492261 -0.4786821 0.0298098 -0.0717947 0.0364598 -0.2301676 -0.5123142 -0.0066352 -0.0337073 -0.0021832 -0.7415367 0.0988917 -0.0394476 0.078728 -0.2230731 1.3146256 0.2484151 0.0904409 0.4378729 1.3186545 -0.1476417 0.0828333 -0.1397067 0.2214299 -0.0754795 -0.0770635 -0.1108972 -0.073498 -0.1373873 0.0903086 -0.2038906 0.0934803 0.0608841 -0.0001096 -0.0335942 -0.0044747 -0.041329 -0.2551894 0.003345 -0.0012688 -0.0101269 -0.2137845 0.3590633 0.0018261 0.1536967 -0.1236013 0.3616949 -0.0574137 0.3269731 -0.2192564 0.1741748 -0.1510624 0.1052589 -0.0157708 0.1450737 -0.0713849 0.0188993 -0.0343059 -0.0037972 -0.0486333 -0.1517329 0.1224004 0.0022309 -0.1668595 0.0313951 -0.0347012 0.0339531 0.0407258 -0.0711444 -0.1568635 -0.1618258 0.004176 -0.3483564 -0.2681798 0.0186359 0.0395374 0.0336104 0.0764612 -0.1946951 -0.188023 0.028742 -0.0911767 0.1116434 -0.0469431 0.0191974 -0.0601006 -0.0992749 -0.0060455 -0.0596082 0.0313427 0.2073198 0.0568816 -0.0047772 -0.0234852 -0.0286472 -0.0814353 0.0365211 0.082609 -0.0199936 0.087891 -0.013603 0.0426143 -0.0409012 0.027229 -0.0190639 0.0135683 -0.0363442 0.0043505 0.0024282 0.0625452 -0.0329677 0.0648791 -0.0520499 0.0371671 -0.1997595 -0.0455098 -0.0852616 -0.0464928 0.0315332 0.0283333 -0.0552871 0.0635103 0.075467 0.0739692 0.0248106 0.0751746 0.0785374 0.0391425 -0.0795354 0.0270996 0.0040551 -0.0576728 0.1995026 0.0255806 -0.0100751 0.040555 0.1313713 -0.0024376 -0.0071618 0.0078123 0.1542385 0.131651 -0.0704958 -0.0004804 -0.0359774 0.1027792 0.010915 -0.0039289 -0.0100405 0.149768 0.0273384 0.0503245 -0.0248561 0.0446892 -0.0270862 0.0345828 -0.0294315 0.035238 0.1490141 0.0568516 0.0198365 -0.0220479 -0.0118452 0.1473009 0.0018387 -0.0189021 0.0039667 0.1674261 0.3611258 -0.0976162 0.0564735 -0.1041777 0.4668273 -0.0122065 -0.0226061 0.0871732 0.2348892 unknown
polarizability: 179.2238907|1.3470193|150.7474367|4.3699931|-4.1695924|85.0654594 unknown
InChI: InChI=1S/C8H9NO5S/c10-4-5-15(13,14)8-3-1-2-7(6-8)9(11)12/h1-3,6,10H,4-5H2
charge 0 multiplicity 1
24 atoms
S  2.203233 0.657805 0.564323
O  2.686563 2.138691 1.054362
O  2.369977 -0.694379 1.499427
O  3.936794 -1.974251 -0.440742
O  -3.953389 -1.250661 -0.109726
O  -2.134274 -2.552016 0.346697
N  -2.691321 -1.418626 0.092435
C  3.090556 0.251597 -1.13122
C  0.345516 0.787524 0.178697
C  3.081653 -1.262576 -1.373881
C  -0.43289 -0.372632 0.268508
C  -0.173008 2.063744 -0.100858
C  -1.813266 -0.215278 0.021227
C  -1.563406 2.178428 -0.336753
C  -2.391342 1.036502 -0.282523
H  2.54303 0.849624 -1.878939
H  4.104883 0.644753 -0.953819
H  2.041729 -1.657441 -1.379838
H  3.509289 -1.442344 -2.377352
H  -0.01152 -1.342853 0.550175
H  0.487678 2.937648 -0.097913
H  -1.999622 3.157948 -0.553739
H  -3.4688 1.097073 -0.457503
H  3.563738 -1.823778 0.478053
