program: Gaussian 09
title: 000170553
version: EM64L-G09RevD.01
frameworkgroup: C1[X(C12H17ClN2)]
method: RPBEPBE
basis: SDD
operation: Freq
keyword: #p
keyword: freq=noraman
keyword: PBEPBE/SDD
title: #p freq=noraman PBEPBE/SDD
converged: YES YES NO NO
title: Mulliken charges:
elementType: Cl N N C C C C C C C C C C C C H H H H H H H H H H H H H H H H H
charge: -0.079170 -0.410566 -0.081969 -0.338340 -0.345546 -0.415841 0.255982 -0.685680 0.318808 -0.314441 -0.376974 -0.188695 -0.843789 -0.244762 -0.103825 0.185386 0.207071 0.217323 0.181335 0.157431 0.222348 0.212487 0.205358 0.214188 0.321746 0.325796 0.254352 0.191860 0.228755 0.229519 0.248649 0.251205
chargesum: 0.00000
title: Mulliken charges with hydrogens summed into heavy atoms:
elementType: Cl N N C C C C C C C C C C C C
charge: -0.079170 -0.088821 -0.081969 0.054117 0.053112 -0.036061 0.255982 -0.053648 0.318808 0.011355 -0.122622 0.003166 -0.136866 0.006443 -0.103825
polarizability: 2.31501157e+02 1.22795972e+01 1.59640797e+02 -2.03230802e+01 1.39390166e+01 1.01088471e+02
1716.lowfreq: -10.2068 -4.0862 0.0017 0.0023 0.0025 4.9299 17.3886 30.1926 61.3228
frequency: 17.3078 30.1480 61.2457 67.8480 92.9229 105.7749 163.1383 181.6519 204.7513 210.7006 224.7871 234.3025 240.8857 276.3980 309.5511 339.4789 380.8653 398.9888 440.8276 450.6091 507.5889 524.5280 536.8734 561.6478 614.4268 709.1766 717.4102 737.2897 772.4875 828.5439 844.1654 853.9884 864.2876 868.5139 933.3733 955.8354 971.9939 986.5057 987.8520 1026.1888 1041.2327 1068.5161 1085.9947 1096.6669 1116.5306 1137.7674 1160.1724 1198.6580 1223.5478 1241.9406 1268.2465 1288.1026 1297.6905 1304.2434 1338.3895 1357.9167 1369.2294 1388.5153 1389.3911 1395.8440 1409.0078 1450.5070 1455.4987 1465.5413 1472.8778 1477.7656 1479.7746 1484.7058 1486.6833 1522.9441 1590.6756 1610.8686 1656.8127 2872.6319 2936.6850 2952.9934 2963.4923 2971.3897 2974.4045 3006.6429 3017.2210 3021.2956 3043.0125 3069.3685 3071.1457 3090.3268 3154.9174 3158.6077 3174.1916 3566.7231
redmass: 3.8873 4.0119 1.7743 3.5392 4.0542 4.0663 3.3057 2.0661 1.8212 2.5370 1.1571 2.9532 3.2885 4.2039 3.7398 3.1923 5.1267 4.0755 3.4410 3.1540 3.4222 3.5229 1.5963 1.8749 6.1133 3.1547 4.2010 1.4883 2.8249 1.8588 1.3550 5.3779 1.6369 1.3371 1.4966 1.4847 1.8387 1.5260 1.2956 3.8541 1.5064 2.5312 1.9788 2.3387 2.0305 1.9004 1.9529 2.0886 1.3073 1.2821 1.3040 1.1283 1.7565 1.5283 1.3423 1.5600 3.2120 1.3773 1.4706 1.3353 2.6244 1.0887 1.7244 1.1064 1.0601 1.0435 1.0461 1.0742 1.4584 2.0693 4.8898 5.8271 5.2885 1.0687 1.0859 1.0401 1.0615 1.0386 1.0600 1.0895 1.0950 1.0978 1.1026 1.1006 1.0996 1.0946 1.0924 1.0901 1.0971 1.0759
irintensity: 0.4754 0.2792 0.1438 0.5828 0.7259 4.6649 6.9607 1.7852 1.8541 7.0652 0.5424 0.9058 1.8758 6.8014 6.0714 4.3823 11.7953 9.3810 1.7809 3.6252 1.5398 2.1392 62.5458 22.1399 17.5827 4.0013 2.6336 5.3268 1.9971 0.6316 44.8489 41.6535 5.1379 17.1212 4.1220 16.0507 4.1960 8.1390 4.7070 6.4808 7.2055 4.6997 8.9808 12.8967 2.9391 5.8129 5.0870 13.8165 0.7192 1.3449 0.7446 0.5064 20.3236 12.9479 32.7174 29.6786 9.2237 21.5737 3.3666 20.4016 72.8294 16.2685 27.6657 37.0961 5.7581 12.1090 15.1257 11.6021 153.4040 307.2637 80.3003 10.3180 355.5141 127.0261 95.0375 38.9962 30.3362 24.9971 62.7283 57.9323 5.2641 23.2382 34.8061 90.9435 53.7589 15.9608 3.8898 10.7371 13.8053 33.9380
temp: 298.150 k
press: 1.00000 atm
elementType: 17 7 7 6 6 6 6 6 6 6 6 6 6 6 6 1 1 1 1 1 1 1 1 1 1 1 1 1 1 1 1 1
symmnumber: 1
zpe: 697495.7 jmol-1
zpe.correction: 0.265662 hartree
zpe.thermalcorrener: 0.281912 hartree
zpe.thermalcorrenthalpy: 0.282857 hartree
zpe.thermalcorrgfe: 0.219867 hartree
zpe.sumelectzpe: -1035.898347 hartree
zpe.sumelectthermal: -1035.882096 hartree
zpe.sumelectthermalent: -1035.881152 hartree
zpe.sumelectthermalfe: -1035.944142 hartree
dipole: 2.7104 4.1467 0.7173
dipole: 5.0056
quadrupole: -101.5622 -87.1394 -100.5542
quadrupole: -5.3419 -3.4855 3.8210
quadrupole: -5.1436 9.2792 -4.1356 -5.3419 -3.4855 3.8210
hfenergy: -1036.1640088 hartree
pointgroup: C01 [X(C12H17Cl1N2)]
dipole: -0.8916084 -1.5368641 0.8493808 debye
polarizability: 230.2497634|22.2461688|148.7688842|8.9852216|-29.1357165|113.2117781 unknown
InChI: InChI=1S/C12H17ClN2/c1-3-4-7-14-9-15-12-6-5-11(13)8-10(12)2/h5-6,8-9,15H,3-4,7H2,1-2H3
charge 0 multiplicity 1
32 atoms
Cl 4.590152 2.250566 -1.021245
N  0.062278 -1.542236 0.318775
N  -1.847466 -0.655101 -0.832131
C  -4.086857 0.427004 -0.659534
C  -4.115411 0.59361 0.875204
C  -3.285465 -0.811006 -1.128085
C  1.099113 -0.63439 -0.016138
C  -4.942328 1.817786 1.323801
C  2.407059 -0.890771 0.512752
C  0.871717 0.496349 -0.846081
C  3.455256 0.0011 0.19309
C  -1.281954 -1.540919 -0.060558
C  2.67604 -2.095859 1.398928
C  1.9311 1.375399 -1.154617
C  3.208444 1.116296 -0.630121
H  -5.123816 0.340101 -1.044394
H  -3.643134 1.330475 -1.122142
H  -3.076974 0.689288 1.247545
H  -4.534255 -0.326451 1.334545
H  -3.723615 -1.727545 -0.658982
H  -3.395433 -0.913727 -2.225842
H  -4.527906 2.750757 0.897291
H  -5.993385 1.734151 0.987422
H  -4.946558 1.922826 2.424403
H  0.331864 -2.31468 0.927727
H  -0.136216 0.660332 -1.233579
H  4.460467 -0.17841 0.587078
H  -1.832871 -2.401016 0.378877
H  2.073071 -2.072926 2.329739
H  2.459285 -3.051172 0.878832
H  3.734588 -2.128959 1.703563
H  1.756411 2.245828 -1.793526
