program: Gaussian 09
title: 000170542
version: EM64L-G09RevD.01
frameworkgroup: C1[X(C18H15NO3)]
method: RPBEPBE
basis: SDD
operation: Freq
keyword: #p
keyword: freq=noraman
keyword: PBEPBE/SDD
title: #p freq=noraman PBEPBE/SDD
converged: YES YES NO NO
title: Mulliken charges:
elementType: O O O N C C C C C C C C C C C C C C C C C C H H H H H H H H H H H H H H H
charge: -0.264293 -0.523925 -0.283598 -0.484568 0.409079 0.474979 0.078204 -0.540883 -0.629070 0.266063 -0.562451 -0.431339 0.330906 -0.362300 0.121286 0.475690 -0.348386 -0.453460 -0.214629 -0.198116 -0.257718 -0.536932 0.292259 0.227119 0.274108 0.237379 0.244149 0.387412 0.310354 0.221894 0.378705 0.224094 0.222233 0.226162 0.220416 0.220408 0.248770
chargesum: 0.00000
title: Mulliken charges with hydrogens summed into heavy atoms:
elementType: O O O N C C C C C C C C C C C C C C C C C C
charge: -0.264293 -0.145220 -0.283598 -0.097155 0.409079 0.474979 0.078204 -0.248624 -0.401951 0.266063 -0.288343 -0.193960 0.330906 -0.118150 0.121286 0.475690 -0.038031 -0.231567 0.009465 0.024116 -0.031556 0.152662
polarizability: 4.52768171e+02 -1.05311737e+01 2.14522645e+02 7.48262023e-03 3.91199441e-02 8.59550616e+01
1716.lowfreq: -5.5653 -0.0005 0.0006 0.0009 4.6272 10.5624 23.9080 45.0064 63.5792
frequency: 23.9060 44.9313 63.5735 64.8697 85.6428 99.7548 117.0413 157.3123 193.4194 196.0340 234.4125 236.1606 251.0077 286.5354 322.9153 323.5663 336.1661 355.5967 389.0782 389.1850 409.3830 418.8874 475.8093 498.1987 516.0913 522.1653 554.5719 587.2740 593.3434 615.1210 617.7951 652.2204 684.0712 696.6679 743.5678 746.5385 765.9150 766.3618 797.9768 799.6572 819.1949 839.9955 853.6379 853.8138 859.9807 882.7341 921.0378 931.1490 948.8900 969.1330 973.3171 983.9741 1001.2547 1002.1630 1024.4497 1046.5629 1089.5113 1110.4952 1123.3512 1141.0683 1150.6254 1170.9802 1177.3332 1184.7685 1188.2023 1217.5175 1252.4918 1270.6918 1273.1511 1292.7965 1313.2038 1323.2404 1385.7320 1401.6696 1425.5724 1433.8006 1436.5714 1439.4434 1467.9411 1469.3452 1473.7158 1486.2113 1521.9145 1544.1665 1564.7453 1589.4962 1606.4543 1616.8587 1628.7585 1651.6209 2959.1022 3047.1435 3103.5444 3114.2948 3125.4039 3127.9663 3129.6157 3141.8380 3145.9229 3159.1437 3162.6491 3163.7576 3195.2230 3372.7446 3602.9949
redmass: 6.0038 3.9072 3.7286 5.5403 5.9726 5.5459 5.2981 5.2187 5.8514 2.3590 4.1518 4.4742 1.4539 3.5111 1.3743 3.6857 6.3314 7.2524 5.9169 7.7734 2.9577 3.4834 2.6148 4.8975 2.9931 6.7616 5.6207 4.1196 5.9076 6.4420 7.0078 4.6357 6.3770 1.8892 6.7907 5.1922 1.9097 2.0169 1.4273 5.8613 1.2125 4.4914 1.4707 3.3227 1.7847 1.5165 1.4437 5.3309 1.4032 1.4999 1.3448 6.1732 3.8356 1.3042 2.3692 4.0797 1.6031 1.2569 1.7973 1.4459 1.5077 1.0570 1.4712 1.3634 1.1661 3.4601 1.8554 2.0192 3.3909 2.3511 1.9032 1.4868 6.9536 5.9496 3.4091 3.6181 2.3482 1.5612 2.2277 1.0504 1.1906 2.5000 3.7497 3.3053 5.7756 8.0633 5.1078 5.6951 2.6693 5.0993 1.0331 1.1041 1.0913 1.0871 1.0978 1.0901 1.0872 1.0938 1.0913 1.0922 1.0999 1.0947 1.0950 1.0800 1.0662
irintensity: 2.4016 1.0496 3.2748 0.6763 0.5275 0.4252 3.1270 0.8142 1.7739 1.5315 0.5043 11.3602 2.2182 18.3015 105.1860 15.6030 2.9938 3.7056 2.8005 1.7691 0.0358 0.1321 29.9523 2.4219 19.7834 24.7070 28.9213 0.5741 36.5481 0.2192 0.2428 4.3585 27.8312 40.2034 0.1582 0.0008 15.5182 25.6756 11.4001 10.3098 88.0419 8.2612 11.7312 5.5211 81.9357 13.5812 21.2871 2.1689 0.2128 29.0378 0.0568 1.0723 46.1517 4.0786 19.3068 51.5176 19.4124 0.1901 114.6284 10.3001 61.4242 1.4753 29.3554 19.5678 5.4706 313.1275 73.5725 45.5651 73.6088 81.5246 17.0744 51.6013 58.3657 28.2158 7.4289 3.9162 58.4951 6.3100 30.9813 13.5172 43.4769 95.7415 135.5938 376.8161 40.8610 49.5603 353.4187 17.3539 69.0643 36.1482 94.6787 49.9768 15.9206 12.2439 31.5728 5.2089 0.4507 35.0618 2.2331 2.6636 40.3020 17.3551 10.0954 193.7614 54.6719
temp: 298.150 k
press: 1.00000 atm
elementType: 8 8 8 7 6 6 6 6 6 6 6 6 6 6 6 6 6 6 6 6 6 6 1 1 1 1 1 1 1 1 1 1 1 1 1 1 1
symmnumber: 1
zpe: 750769.2 jmol-1
zpe.correction: 0.285953 hartree
zpe.thermalcorrener: 0.304543 hartree
zpe.thermalcorrenthalpy: 0.305487 hartree
zpe.thermalcorrgfe: 0.238512 hartree
zpe.sumelectzpe: -973.822633 hartree
zpe.sumelectthermal: -973.804043 hartree
zpe.sumelectthermalent: -973.803099 hartree
zpe.sumelectthermalfe: -973.870074 hartree
dipole: 4.1331 5.9047 0.0202
dipole: 7.2075
quadrupole: -91.8742 -112.4407 -135.6586
quadrupole: -0.2987 -0.0151 0.0845
quadrupole: 21.4503 0.8838 -22.3341 -0.2987 -0.0151 0.0845
hfenergy: -974.108586 hartree
pointgroup: C01 [X(C18H15N1O3)]
dipole: 1.6322032 -2.3186648 0.026657 debye
polarizability: 452.7111758|11.1557624|214.5521749|-0.1737373|-1.8797503|85.9825267 unknown
InChI: InChI=1S/C18H15NO3/c1-22-15-8-7-12-11-17(20)16(10-13(12)9-15)18(21)19-14-5-3-2-4-6-14/h2-11,19-20H,1H3
charge 0 multiplicity 1
37 atoms
O  5.845452 1.590918 0.042245
O  -0.924021 -2.428581 0.102925
O  -1.494854 1.815429 0.03762
N  -2.524465 -0.294146 0.068304
C  2.397036 0.240984 0.061938
C  2.625114 -1.190878 0.08414
C  -0.060394 -0.135392 0.066951
C  1.049812 0.718807 0.054445
C  1.493307 -2.066118 0.097634
C  0.195853 -1.556314 0.08871
C  3.512572 1.131518 0.048338
C  3.97229 -1.669212 0.092116
C  4.820862 0.631077 0.056602
C  5.054166 -0.784295 0.0788
C  -1.417077 0.544623 0.056181
C  -3.897676 0.066808 0.064245
C  -4.362005 1.411365 0.045651
C  -4.842266 -0.998624 0.079764
C  -5.750941 1.664245 0.042954
C  -6.224647 -0.728248 0.076805
C  -6.690452 0.607958 0.058336
C  7.231752 1.117968 0.048961
H  0.840899 1.794357 0.038059
H  1.659997 -3.152031 0.115454
H  3.357297 2.214764 0.031361
H  4.157154 -2.749706 0.109015
H  6.074475 -1.17917 0.085372
H  -2.311276 -1.302678 0.083033
H  -3.634981 2.224806 0.034046
H  -4.487437 -2.037177 0.094319
H  -0.645375 -3.375714 0.105533
H  -6.099309 2.703364 0.028554
H  -6.937899 -1.560147 0.089066
H  -7.76513 0.819579 0.055931
H  7.456666 0.507586 -0.84744
H  7.4572 0.535246 0.963454
H  7.843201 2.032028 0.034781
