program: Gaussian 09
title: 000170534
version: EM64L-G09RevD.01
frameworkgroup: C1[X(C15H17NO)]
method: RPBEPBE
basis: SDD
operation: Freq
keyword: #p
keyword: freq=noraman
keyword: PBEPBE/SDD
title: #p freq=noraman PBEPBE/SDD
converged: YES YES NO NO
title: Mulliken charges:
elementType: O N C C C C C C C C C C C C C C C H H H H H H H H H H H H H H H H H
charge: -0.270158 -0.512945 0.271211 0.321252 -0.556628 0.346849 -0.384671 -0.378851 0.467463 -0.841513 -0.454700 -0.392629 -0.239716 -0.197494 -0.216538 -0.271345 -0.686943 0.252391 0.264448 0.301823 0.244224 0.240176 0.219598 0.243335 0.220298 0.265484 0.204628 0.204952 0.221390 0.220760 0.225990 0.205541 0.231111 0.231205
chargesum: 0.00000
title: Mulliken charges with hydrogens summed into heavy atoms:
elementType: O N C C C C C C C C C C C C C C C
charge: -0.270158 -0.211121 0.271211 0.321252 -0.304236 0.346849 -0.120223 -0.134627 0.467463 -0.138404 -0.234402 -0.127145 0.169865 0.023896 0.004223 -0.045355 -0.019086
polarizability: 2.96298005e+02 7.45727243e+00 1.72691624e+02 7.24534738e+00 -7.12759916e+00 9.79952513e+01
1716.lowfreq: -3.7438 -2.2058 -0.0007 -0.0005 0.0004 7.0173 34.3071 44.3900 51.8332
frequency: 34.2959 44.3878 51.8274 79.0649 106.3737 134.7169 164.9891 178.6446 200.6349 215.7971 234.0906 246.7962 287.2676 320.2678 348.1498 377.2287 409.6074 444.5631 459.3279 483.2397 509.4003 523.3354 575.2407 579.5755 614.5041 625.5360 692.7547 712.9064 721.4424 751.0983 792.9196 802.0495 825.5169 833.6616 834.8545 875.8796 878.7934 887.1783 933.7199 953.6188 963.7322 980.7436 981.9892 996.4862 1024.7224 1041.1154 1044.7641 1086.6148 1112.3871 1116.7809 1136.7653 1169.1501 1172.5278 1188.1224 1207.5802 1244.9954 1261.6806 1273.7032 1306.3094 1327.5449 1362.5997 1371.2105 1385.4749 1396.7076 1398.7194 1426.5548 1436.4799 1460.7258 1469.0087 1473.8003 1477.7975 1487.5147 1488.1659 1496.8947 1516.2052 1583.4311 1595.8913 1617.6838 1633.6520 2948.2787 2953.8885 2996.2660 3004.5835 3030.7568 3089.5497 3093.5493 3104.8442 3108.4927 3126.0014 3138.2919 3147.7136 3148.5921 3158.9097 3167.9571 3171.7172 3542.3592
redmass: 3.8947 3.8271 4.0930 4.2712 1.7131 3.6291 2.1970 1.4947 3.7089 2.5128 4.4638 1.2715 3.7144 3.9634 3.9438 3.9272 2.9420 2.9236 1.5849 2.9034 2.5215 4.9699 3.1210 5.5423 6.2019 5.3274 2.0418 3.6876 5.4914 1.7381 2.7166 1.6708 1.3243 1.2070 3.0055 3.6548 1.4412 1.4458 1.3426 2.5976 1.3860 2.8806 1.6609 1.6075 2.1457 1.5516 2.5697 1.5623 2.2328 2.1528 1.4419 1.0774 1.5829 1.1358 1.8792 2.6889 1.1405 1.7784 1.7750 1.8200 2.1341 1.8652 4.1213 1.3077 1.3186 2.9450 2.4132 1.0400 1.1018 1.5653 1.0900 2.1611 1.1784 1.4286 2.5281 6.7383 3.9884 6.2119 6.6599 1.0553 1.0428 1.0361 1.1073 1.0925 1.0970 1.0989 1.1012 1.0877 1.0862 1.0928 1.0890 1.0902 1.0949 1.0980 1.0969 1.0751
irintensity: 0.5998 0.3959 2.4297 1.4989 3.1505 0.7836 1.9755 1.8118 1.6812 1.8173 1.3552 0.4553 1.6265 0.5756 4.9344 14.6807 1.5287 21.9352 92.2700 34.8389 2.7575 7.1016 1.0263 14.7171 1.8461 2.2858 41.8688 1.6544 14.8264 91.3928 15.2639 22.3231 4.3644 2.5501 2.4939 9.8717 22.2294 5.7405 1.1533 19.3522 1.2845 3.8362 2.2746 15.0489 8.5726 12.4534 110.2048 12.2521 24.8162 12.6419 4.4412 9.9192 119.2610 6.4566 101.1210 63.3879 0.0920 101.1227 5.3772 44.9529 56.9923 13.6318 17.0219 18.0692 51.6004 40.8000 1.6493 11.6133 27.7830 13.7248 32.5673 85.4213 101.6167 49.8506 471.9187 6.3998 19.0151 214.9897 19.8676 41.3578 36.6699 31.0998 40.2064 21.7446 19.3453 30.0536 35.5907 15.4024 2.9112 29.8245 31.1374 6.5811 27.4434 7.9246 10.7191 19.0618
temp: 298.150 k
press: 1.00000 atm
elementType: 8 7 6 6 6 6 6 6 6 6 6 6 6 6 6 6 6 1 1 1 1 1 1 1 1 1 1 1 1 1 1 1 1 1
symmnumber: 1
zpe: 738055.5 jmol-1
zpe.correction: 0.281110 hartree
zpe.thermalcorrener: 0.297268 hartree
zpe.thermalcorrenthalpy: 0.298212 hartree
zpe.thermalcorrgfe: 0.236813 hartree
zpe.sumelectzpe: -710.535606 hartree
zpe.sumelectthermal: -710.519449 hartree
zpe.sumelectthermalent: -710.518505 hartree
zpe.sumelectthermalfe: -710.579904 hartree
dipole: 0.6688 -0.0809 -0.5267
dipole: 0.8551
quadrupole: -94.1009 -88.3737 -105.0826
quadrupole: -9.3203 1.0467 -2.2038
quadrupole: 1.7515 7.4787 -9.2302 -9.3203 1.0467 -2.2038
hfenergy: -710.8167168 hartree
pointgroup: C01 [X(C15H17N1O1)]
dipole: 0.2676575 0.0390228 0.2000409 debye
polarizability: 296.1102125|-2.4567935|172.5193079|-12.8789236|-6.0844074|98.3553601 unknown
InChI: InChI=1S/C15H17NO/c1-3-17-14-9-10-15(12(2)11-14)16-13-7-5-4-6-8-13/h4-11,16H,3H2,1-2H3
charge 0 multiplicity 1
34 atoms
O  4.114708 0.215926 -0.2914
N  -1.389605 -1.023595 0.244265
C  -0.025646 -0.651961 0.099551
C  0.917192 -1.651415 -0.312926
C  2.278644 -1.305565 -0.413551
C  2.731725 0.006576 -0.133415
C  0.438689 0.652853 0.399027
C  1.803269 0.992961 0.275909
C  -2.544671 -0.222935 0.121274
C  0.453756 -3.060831 -0.636122
C  -3.76274 -0.700192 0.68871
C  -2.562874 1.010925 -0.591114
C  4.636205 1.563357 -0.000625
C  -4.958007 0.032468 0.548581
C  -3.764844 1.738612 -0.715446
C  -4.970816 1.264024 -0.14842
C  6.141298 1.519597 -0.252446
H  3.016518 -2.051589 -0.726978
H  -0.266749 1.407076 0.759366
H  -1.55979 -1.996138 0.503821
H  2.120214 2.012024 0.515626
H  1.281583 -3.663759 -1.04412
H  0.078235 -3.595317 0.261362
H  -0.364818 -3.053632 -1.380964
H  -3.76306 -1.646587 1.245279
H  -1.652613 1.379225 -1.072354
H  4.139429 2.304112 -0.661722
H  4.413018 1.82868 1.054005
H  -5.881494 -0.356427 0.992911
H  -3.75877 2.682108 -1.27384
H  -5.898298 1.836838 -0.250233
H  6.590763 2.508807 -0.049703
H  6.623314 0.774336 0.403121
H  6.351935 1.246437 -1.30053
