program: Gaussian 09
title: 000170585
version: EM64L-G09RevD.01
frameworkgroup: C1[X(C27H30)]
method: RPBEPBE
basis: SDD
operation: Freq
keyword: #p
keyword: freq=noraman
keyword: PBEPBE/SDD
title: #p freq=noraman PBEPBE/SDD
converged: YES YES NO NO
title: Mulliken charges:
elementType: C C C C C C C C C C C C C C C C C C C C C C C C C C C H H H H H H H H H H H H H H H H H H H H H H H H H H H H H H
charge: 0.235579 0.055508 -0.618052 -0.487201 0.278720 0.242870 0.173418 -0.788681 -0.768019 0.453016 -0.422887 -0.428731 -0.727559 -0.795207 0.487196 -0.252290 -0.258933 -0.410283 -0.412960 -0.413982 -0.412381 -0.245078 -0.254900 -0.247379 -0.252214 -0.262800 -0.246377 0.252415 0.212842 0.209047 0.184880 0.256947 0.237067 0.205718 0.221625 0.225764 0.219290 0.240338 0.247663 0.209168 0.226036 0.217414 0.215850 0.218194 0.221907 0.222012 0.224149 0.260569 0.233602 0.248332 0.226499 0.222948 0.221530 0.226118 0.221441 0.223479 0.226761
chargesum: 0.00000
title: Mulliken charges with hydrogens summed into heavy atoms:
elementType: C C C C C C C C C C C C C C C C C C C C C C C C C C C
charge: 0.235579 0.055508 -0.152795 -0.093274 0.278720 0.242870 0.173418 -0.088950 -0.101340 0.453016 -0.182549 -0.181068 -0.074941 -0.139255 0.487196 -0.030278 -0.034784 -0.149714 -0.179358 -0.165650 -0.185881 -0.022130 -0.033369 -0.021261 -0.030773 -0.039321 -0.019616
polarizability: 2.74176036e+02 6.36184459e+00 3.05337256e+02 1.01828800e+01 -2.34443026e+00 2.41618419e+02
1716.lowfreq: -7.4228 -4.0917 -0.0007 -0.0003 -0.0003 10.1702 22.0628 39.0126 42.5455
frequency: 21.7625 38.9480 42.5268 53.3585 56.9996 61.5581 85.7385 106.8651 147.2503 157.5546 185.0530 197.8720 209.0213 223.3491 233.8257 241.5428 250.2185 259.3740 263.0555 273.9628 292.7496 309.4368 328.0940 346.6630 358.1748 379.4450 387.2138 404.9604 407.6701 411.1536 436.8046 446.9270 489.9042 500.5840 537.3203 539.5746 560.7157 571.9905 579.3771 604.2564 617.6844 618.0078 639.1911 700.2868 704.5628 706.0149 709.0369 734.9991 765.5528 769.1759 771.9556 773.9800 803.6840 823.9258 851.3959 856.2004 859.3106 876.8715 890.2323 907.1981 917.1410 923.9417 929.6188 938.1378 947.4825 951.6318 974.2968 978.3529 979.7887 984.8051 990.1671 990.3055 992.0267 995.7961 1005.5499 1023.2018 1025.1134 1028.0202 1036.8229 1042.7534 1074.8853 1081.2723 1084.4347 1093.5277 1102.5959 1115.8521 1129.9292 1142.4207 1150.8902 1167.4672 1171.6650 1171.9982 1173.2661 1195.8874 1197.5068 1203.2904 1204.5063 1225.7248 1254.6487 1275.7055 1282.2696 1315.8420 1318.7186 1322.8020 1323.7499 1334.2098 1373.8026 1374.1993 1378.5532 1382.6744 1387.1005 1388.8735 1398.0856 1432.1245 1433.0422 1440.4503 1453.8132 1462.9493 1464.8928 1467.2614 1468.9952 1472.0832 1472.9750 1476.8850 1478.2020 1484.7850 1487.1504 1492.9929 1504.1569 1586.9171 1587.7867 1592.6977 1607.9439 1610.7329 1611.3736 2960.6787 2971.2616 2977.9972 2981.0243 2984.3550 3016.7221 3026.0639 3066.7042 3069.6643 3073.5580 3075.8322 3077.6993 3078.1329 3081.4893 3086.3974 3104.4294 3113.9030 3114.7143 3115.2371 3121.1173 3122.7653 3123.4993 3135.4878 3135.8969 3137.2368 3148.2300 3153.5665 3155.9711 3161.1444 3165.5808
redmass: 4.4956 4.9039 4.0967 3.6826 4.2464 3.9631 4.0092 4.1920 3.2965 2.7161 3.4149 2.0706 2.0629 2.4085 1.4833 1.7350 1.4518 1.9861 1.8666 2.9672 3.1648 3.2776 2.8813 2.5925 2.2040 1.4223 2.0520 2.8592 2.6982 2.3812 3.5958 3.1842 3.3510 3.1024 3.1629 3.1977 3.2597 3.7997 3.4831 4.2895 6.3399 6.3779 3.9345 5.0337 3.3644 1.9339 1.6715 3.9251 1.3667 2.9660 1.9888 2.3410 2.5986 2.8477 1.2514 1.2554 2.0044 1.4254 2.4095 1.8092 1.7909 1.4352 1.5536 1.5705 1.6297 1.5725 1.4637 1.5757 1.3815 1.3154 5.6332 5.4689 1.3196 1.3293 1.4019 2.6075 2.4539 2.5488 2.3378 2.0755 1.8133 1.7369 1.7888 1.9261 1.8353 2.4552 2.7407 2.2475 1.8923 1.9405 1.0588 1.0711 1.0557 1.1334 1.8527 1.7330 2.0549 2.6064 3.0417 1.7130 1.8115 1.3809 1.5166 1.4204 1.4148 1.3681 3.4644 6.2351 1.4043 4.8862 1.3015 1.2198 1.2116 2.2365 2.2231 2.2524 1.0849 1.1401 1.2763 1.1728 1.1535 1.0781 1.2901 1.2792 1.1689 1.5330 1.8932 1.0745 1.0581 6.0180 5.8054 7.1562 6.2524 6.0643 6.2969 1.0620 1.0351 1.0347 1.0362 1.0385 1.0599 1.0963 1.0998 1.0991 1.1007 1.0976 1.1004 1.0997 1.1010 1.0991 1.0969 1.0852 1.0853 1.0852 1.0889 1.0868 1.0869 1.0932 1.0934 1.0932 1.0942 1.0952 1.1001 1.1008 1.0982
irintensity: 0.0063 0.0315 0.0283 0.0100 0.0481 0.0720 0.1918 0.4482 0.6346 0.3797 0.0134 0.3720 0.3214 0.2630 0.0109 0.6455 0.6138 0.3876 0.2025 0.3260 0.2958 0.0261 0.2775 0.2044 0.1736 0.2266 0.0066 0.0295 0.1516 0.3992 1.5388 0.1953 2.4466 2.1588 3.6289 13.5222 17.8769 2.1546 4.8408 1.2834 0.2915 0.0476 5.2831 0.9340 13.8211 47.6209 51.0511 3.4691 50.2798 25.0183 18.6326 49.3354 7.1213 3.7307 0.3112 0.2932 0.6773 1.0485 3.3375 0.7771 3.9415 0.9453 6.2770 1.0218 0.0835 3.5930 3.9485 10.6232 0.4313 0.0111 0.2003 0.1597 0.5735 0.1390 0.5198 9.7750 22.9452 11.3341 0.8206 7.3360 8.1812 4.5361 4.2185 7.4824 4.7901 4.3855 2.2735 1.7488 1.1744 0.9362 0.1370 0.8439 0.1219 1.5148 3.0256 5.1378 5.6668 8.3053 6.4879 7.4607 4.6127 10.4620 10.7608 0.6983 1.5257 5.3221 8.1318 3.0898 8.1437 4.1418 5.5554 23.9661 16.8815 6.8377 12.0524 9.1323 3.5179 2.3624 3.2062 0.6715 7.5339 6.3951 4.4835 10.9089 18.4784 44.9870 18.2007 14.5427 12.0096 1.2191 1.6719 0.5876 13.4974 7.8170 6.9395 24.4846 37.5951 24.3181 17.4920 37.7183 19.1569 21.8433 9.3272 72.9700 23.9831 15.1718 8.7923 38.9286 55.4567 45.1298 25.6141 7.4053 5.5466 8.9617 4.4911 1.6225 0.8637 36.1273 25.6108 31.4422 23.2321 35.7031 41.7014 26.3439 12.9916
temp: 298.150 k
press: 1.00000 atm
elementType: 6 6 6 6 6 6 6 6 6 6 6 6 6 6 6 6 6 6 6 6 6 6 6 6 6 6 6 1 1 1 1 1 1 1 1 1 1 1 1 1 1 1 1 1 1 1 1 1 1 1 1 1 1 1 1 1 1
symmnumber: 1
zpe: 1276786.3 jmol-1
zpe.correction: 0.486302 hartree
zpe.thermalcorrener: 0.510914 hartree
zpe.thermalcorrenthalpy: 0.511858 hartree
zpe.thermalcorrgfe: 0.432764 hartree
zpe.sumelectzpe: -1044.932063 hartree
zpe.sumelectthermal: -1044.907451 hartree
zpe.sumelectthermalent: -1044.906507 hartree
zpe.sumelectthermalfe: -1044.985601 hartree
dipole: -0.6102 -0.0095 0.3123
dipole: 0.6855
quadrupole: -162.4794 -150.6478 -158.5625
quadrupole: 1.4996 0.3553 -0.3017
quadrupole: -5.2494 6.5821 -1.3326 1.4996 0.3553 -0.3017
hfenergy: -1045.4183648 hartree
pointgroup: C01 [X(C27H30)]
dipole: 0.2469188 0.049389 -0.0966136 debye
polarizability: 275.2312876|-12.9693632|300.5615024|10.8907167|10.6731264|245.3389216 unknown
InChI: InChI=1S/C27H30/c1-25(2,21-13-7-5-8-14-21)19-26(3)20-27(4,22-15-9-6-10-16-22)24-18-12-11-17-23(24)26/h5-18H,19-20H2,1-4H3
charge 0 multiplicity 1
57 atoms
C  0.091496 0.940462 -0.781742
C  -1.29684 -0.590913 0.69561
C  0.121411 -0.399873 0.031146
C  1.440835 1.740063 -0.771429
C  -0.985092 1.72385 -0.005648
C  -1.765203 0.865656 0.8082
C  2.831597 1.053815 -1.052621
C  -0.440157 0.722482 -2.233105
C  -1.161958 -1.253266 2.098435
C  -2.236096 -1.467793 -0.173665
C  -1.258843 3.10714 -0.050928
C  -2.813884 1.38796 1.593979
C  3.86224 2.218716 -1.231373
C  2.828996 0.245382 -2.373774
C  3.310703 0.200548 0.151197
C  -2.312795 3.632807 0.735528
C  -3.084875 2.777386 1.558197
C  -3.499361 -1.021217 -0.636938
C  -1.838737 -2.792421 -0.504692
C  3.719835 -1.151035 0.016469
C  3.404662 0.785039 1.445423
C  -4.336009 -1.865108 -1.404757
C  -2.668784 -3.637628 -1.271125
C  -3.92683 -3.177547 -1.726755
C  4.190754 -1.893306 1.124913
C  3.871135 0.050792 2.555903
C  4.266875 -1.298899 2.403144
H  0.865669 -0.314466 0.842245
H  0.411211 -1.260889 -0.595742
H  1.520613 2.238878 0.214269
H  1.340462 2.558376 -1.515372
H  -1.441374 0.258461 -2.215739
H  0.222892 0.06778 -2.821446
H  -0.52525 1.690645 -2.762194
H  -0.70305 -2.255383 2.021747
H  -0.526224 -0.633258 2.756022
H  -2.149875 -1.37532 2.578982
H  -0.659926 3.776917 -0.679402
H  -3.411303 0.729565 2.235928
H  3.614241 2.818423 -2.127664
H  4.885143 1.817948 -1.352691
H  3.866106 2.897152 -0.35909
H  3.854148 -0.074796 -2.6382
H  2.19514 -0.656359 -2.316935
H  2.451753 0.872777 -3.200944
H  -2.529169 4.707207 0.712935
H  -3.893447 3.193227 2.170185
H  -3.832786 -0.004712 -0.404503
H  -0.868172 -3.170104 -0.160154
H  3.673307 -1.643521 -0.959655
H  3.107182 1.829752 1.59599
H  -5.306739 -1.492577 -1.752397
H  -2.336003 -4.653961 -1.512322
H  -4.5740 -3.831242 -2.322333
H  4.497564 -2.936727 0.986318
H  3.926974 0.531126 3.539681
H  4.629635 -1.872508 3.263389
