program: Gaussian 09
title: 000170569
version: EM64L-G09RevD.01
frameworkgroup: C1[X(C20H18O8)]
method: RPBEPBE
basis: SDD
operation: Freq
keyword: #pfreq=noraman
keyword: PBEPBE/SDD
title: #p freq=noraman PBEPBE/SDD
converged: YES YES NO NO
title: Mulliken charges:
elementType: O O O O O O O O C C C C C C C C C C C C C C C C C C C C H H H H H H H H H H H H H H H H H H
charge: -0.229712 -0.279251 -0.254275 -0.209992 -0.202810 -0.307547 -0.288278 -0.307960 0.129896 0.271152 0.115245 -0.040709 0.164934 0.268463 0.054442 -0.551139 0.444725 -0.333018 -0.199682 -0.530260 -0.602334 0.278185 0.243354 0.014632 -0.509059 -0.527674 -0.525208 -0.524624 0.287785 0.280916 0.232845 0.246546 0.297762 0.263178 0.246154 0.239767 0.227449 0.222087 0.227066 0.253510 0.218971 0.256666 0.226955 0.251691 0.233390 0.225766
chargesum: 0.00000
title: Mulliken charges with hydrogens summed into heavy atoms:
elementType: O O O O O O O O C C C C C C C C C C C C C C C C C C C C
charge: -0.229712 -0.279251 -0.254275 -0.209992 -0.202810 -0.307547 -0.288278 -0.307960 0.129896 0.271152 0.115245 -0.040709 0.164934 0.268463 0.054442 -0.263354 0.444725 -0.052102 0.279710 -0.232498 -0.339156 0.278185 0.243354 0.014632 0.204310 0.174989 0.177384 0.186223
polarizability: 4.25674639e+02 -1.01550104e+01 2.55180450e+02 -1.57905513e+00 5.20104901e+00 1.40677158e+02
1716.lowfreq: -3.1063 -0.0009 -0.0003 0.0006 2.8915 6.5542 16.3572 23.9646 34.5554
frequency: 16.2586 23.8479 34.4973 37.9025 54.7623 61.5177 76.3244 88.8565 93.0144 104.5116 130.0164 137.8840 142.8348 156.1525 159.8437 171.5246 183.3201 189.6854 195.8814 204.2774 212.6224 230.2480 242.7985 277.2092 284.5926 298.8313 319.2769 329.6350 332.2399 344.4416 352.7003 371.2663 413.0196 439.6270 463.4126 488.6041 506.5718 526.4410 537.7210 562.2522 586.2062 601.1038 606.2519 621.8599 643.4241 657.2661 691.6992 695.4082 712.3815 737.0236 767.1018 773.1390 794.3904 812.6691 832.1073 850.0601 865.1146 868.9687 886.8363 892.9134 895.4255 920.4760 942.3018 962.7004 993.2353 1000.8889 1034.4979 1056.9939 1057.4353 1080.3835 1103.5578 1111.8204 1112.4485 1114.3588 1129.9175 1137.8091 1148.6600 1151.0676 1153.8631 1159.3188 1163.9544 1175.8593 1206.4208 1218.0573 1256.0654 1289.3411 1324.5128 1339.4777 1354.5615 1362.3857 1393.7786 1395.6852 1405.4990 1418.7339 1427.6740 1434.3946 1435.6506 1453.6508 1456.9885 1458.0886 1459.1952 1459.8329 1464.2831 1467.1049 1476.6171 1481.1897 1484.6350 1486.7450 1546.6205 1555.4039 1591.3834 1604.4609 1616.1133 1626.0307 2971.1705 2974.3397 2976.4459 2991.5468 2997.3460 3069.2641 3076.1322 3078.7721 3103.0120 3119.3469 3119.9551 3123.4104 3126.9195 3140.8805 3154.9202 3191.6598 3202.2726 3209.3282
redmass: 4.8628 4.7132 4.4081 4.8984 5.5657 3.8263 3.7983 2.9798 3.4071 3.4718 3.0171 3.6573 4.2252 1.1581 1.1428 1.3456 1.7235 4.3470 4.3653 2.3414 2.8732 3.8899 4.8599 6.0430 6.3793 5.8875 6.9976 4.7408 5.6178 6.8381 8.7662 5.8428 7.9655 5.5085 6.2844 6.4699 7.4370 6.6795 8.8553 7.4051 5.1804 5.7314 5.9189 8.0822 4.7625 5.0551 9.0390 5.8532 5.7223 6.8312 3.8426 5.9095 8.2976 7.8321 1.6759 6.0648 2.4122 2.1129 1.5522 1.7475 8.4053 7.6319 9.3006 7.6913 7.0067 6.6184 6.8299 5.0708 2.8307 1.5249 1.2494 1.2459 1.2383 1.2388 2.4216 1.1881 1.5342 1.5181 1.5120 1.4731 2.0646 3.6865 2.3162 1.4508 4.2690 5.7470 2.1703 3.3441 4.7816 1.3617 2.8287 5.7867 3.5316 1.2716 2.6836 1.4109 1.2505 1.8971 1.1467 1.1334 1.0770 1.0672 1.0549 2.0992 1.0609 1.1366 1.0538 1.0595 11.1644 7.2230 8.2626 7.0862 9.1532 9.1315 1.0311 1.0323 1.0297 1.0638 1.0299 1.1036 1.1053 1.1010 1.1046 1.1031 1.1029 1.1038 1.1068 1.1041 1.0916 1.0949 1.0924 1.0946
irintensity: 2.8669 0.0087 5.9907 1.4978 1.8239 2.4981 1.3169 3.8716 7.1771 8.8804 8.1824 4.1827 1.0677 0.5181 0.1040 1.0202 1.5482 2.9414 1.2418 5.0393 8.8625 0.8029 12.9190 3.9412 5.7731 5.2409 1.2291 6.1841 3.2586 0.9932 1.4549 4.6516 8.0770 2.7461 2.2897 6.0552 12.6751 3.7962 0.8271 6.4875 0.9448 11.6327 4.8049 11.5518 7.0045 40.7064 2.1381 5.6207 1.6442 26.5448 7.1140 12.9526 2.8114 11.7413 36.4922 30.1189 24.2564 27.8054 12.6528 12.2783 18.6986 48.2581 58.5634 61.6152 87.4577 198.7557 169.2070 96.7338 2.3259 19.3100 0.1410 14.4855 5.4378 5.9695 19.8377 13.8884 29.1338 15.9419 0.9132 13.2150 41.6413 54.4092 27.2340 22.4358 575.2772 64.8757 38.4759 112.2465 4.1870 14.6256 38.3470 64.1613 40.0252 6.6966 168.7415 14.5643 27.0042 260.9265 12.3729 12.8752 31.4201 2.7844 17.7315 31.3939 3.0703 3.8885 15.5946 31.5231 98.6336 86.2487 4.0804 36.4259 270.6935 138.3173 73.0593 96.5112 67.1911 132.0789 57.4756 27.6432 21.4788 31.7236 31.0778 27.3610 27.9176 20.1887 25.2009 13.8861 2.5399 8.7839 1.3652 1.9983
temp: 298.150 k
press: 1.00000 atm
elementType: 8 8 8 8 8 8 8 8 6 6 6 6 6 6 6 6 6 6 6 6 6 6 6 6 6 6 6 6 1 1 1 1 1 1 1 1 1 1 1 1 1 1 1 1 1 1
symmnumber: 1
zpe: 896461.3 jmol-1
zpe.correction: 0.341444 hartree
zpe.thermalcorrener: 0.368457 hartree
zpe.thermalcorrenthalpy: 0.369401 hartree
zpe.thermalcorrgfe: 0.282203 hartree
zpe.sumelectzpe: -1372.568035 hartree
zpe.sumelectthermal: -1372.541023 hartree
zpe.sumelectthermalent: -1372.540078 hartree
zpe.sumelectthermalfe: -1372.627276 hartree
dipole: 2.3282 -0.9219 1.7120
dipole: 3.0334
quadrupole: -105.1986 -157.9063 -158.7829
quadrupole: 7.7441 2.9043 1.7959
quadrupole: 35.4307 -17.2770 -18.1537 7.7441 2.9043 1.7959
hfenergy: -1372.9094791 hartree
pointgroup: C01 [X(C20H18O8)]
dipole: -0.9138758 -0.4067266 0.6508892 debye
polarizability: 425.7016399|-5.4625183|173.5341528|-8.4071151|52.0510359|222.2964537 unknown
InChI: InChI=1S/C20H18O8/c1-22-13-5-10(6-14(23-2)18(13)24-3)11-8-26-12-7-15-19(28-9-27-15)20(25-4)16(12)17(11)21/h5-8H,9H2,1-4H3
charge 0 multiplicity 1
46 atoms
O  -1.549626 1.69534 1.702899
O  -5.97179 -0.751745 -0.636514
O  -6.291573 0.886407 1.065186
O  -3.128789 -1.595594 -1.552648
O  -0.524498 -1.218659 -1.112168
O  4.742281 0.229289 2.313815
O  3.980549 -0.332402 -2.547085
O  5.826881 -0.197547 -0.336351
C  -2.28799 -0.004368 0.066139
C  -2.57607 0.989414 1.052002
C  -3.414317 -0.672978 -0.566634
C  -4.702954 -0.308963 -0.133218
C  0.164211 0.457542 0.479936
C  -4.91143 0.676124 0.8588
C  -0.86706 -0.330561 -0.269019
C  -3.873567 1.360334 1.476528
C  1.619466 0.226539 0.268503
C  -0.229451 1.412596 1.383703
C  -6.956415 -0.224092 0.334056
C  2.14371 -0.032593 -1.0233
C  2.512592 0.277782 1.372848
C  3.897928 0.116122 1.182572
C  3.533186 -0.184448 -1.220736
C  4.431672 -0.083185 -0.121194
C  -4.214029 -2.406661 -2.144124
C  5.532986 -0.984527 2.62504
C  4.819167 -1.517712 -2.831766
C  6.560222 1.078048 -0.142654
H  -4.020609 2.129181 2.234835
H  0.447747 2.064254 1.939262
H  -7.222683 -1.016589 1.060603
H  -7.821906 0.17408 -0.214262
H  1.486206 -0.117975 -1.889479
H  2.147763 0.403271 2.397167
H  -3.692576 -3.064144 -2.854197
H  -4.946882 -1.771224 -2.668204
H  -4.725606 -3.004394 -1.37005
H  4.856491 -1.822482 2.879931
H  6.145041 -0.717404 3.500119
H  6.175651 -1.265369 1.771902
H  4.240681 -2.443473 -2.647816
H  5.734401 -1.509143 -2.216317
H  5.069362 -1.440754 -3.90095
H  6.415094 1.452818 0.88663
H  6.21224 1.828423 -0.876065
H  7.620095 0.838919 -0.319924
