program: Gaussian 09
title: 000170518
version: EM64L-G09RevD.01
frameworkgroup: C1[X(C10H7N3O)]
method: RPBEPBE
basis: SDD
operation: Freq
keyword: #p
keyword: freq=noraman
keyword: PBEPBE/SDD
title: #p freq=noraman PBEPBE/SDD
converged: NO NO NO YES
title: Mulliken charges:
elementType: O N N N C C C C C C C C C C H H H H H H H
charge: -0.258461 -0.354204 -0.432274 -0.036987 0.223501 0.338252 0.188315 -0.284376 -0.266145 0.216505 -0.331830 -0.394394 -0.225696 -0.251387 0.246671 0.254166 0.311217 0.236231 0.350308 0.236326 0.234262
chargesum: 0.00000
title: Mulliken charges with hydrogens summed into heavy atoms:
elementType: O N N N C C C C C C C C C C
charge: -0.258461 -0.354204 -0.081966 -0.036987 0.223501 0.338252 0.188315 -0.037704 -0.011979 0.216505 -0.020613 -0.158163 0.010629 -0.017125
polarizability: 1.99818570e+02 -6.79476581e+00 1.47567930e+02 -7.17637441e-04 -2.91144124e-04 4.98013964e+01
1716.lowfreq: -5.3703 -0.0002 0.0005 0.0007 5.9951 8.4071 102.1601 113.7426 209.0778
frequency: 102.1444 113.7415 209.0776 217.9346 266.1247 341.5985 360.4213 422.1926 429.6012 501.3405 512.0888 555.2318 557.4343 597.4417 604.1498 666.9769 683.4928 705.0792 711.7924 765.7875 769.4272 774.4504 823.3654 854.5991 889.8420 961.8648 977.1958 989.2938 998.9300 1022.8495 1036.2406 1049.8305 1123.4911 1142.8390 1176.4633 1178.8518 1234.7864 1286.5341 1315.3246 1347.9918 1354.6965 1391.0154 1409.9037 1440.6266 1475.9777 1538.7477 1560.9775 1616.3534 1621.9723 1679.3257 3129.7273 3143.4169 3146.4899 3164.5826 3179.4172 3190.0635 3633.1336
redmass: 6.9616 4.6977 4.6535 7.6954 4.9522 6.5534 6.4224 3.5091 7.8413 6.7893 3.6739 3.3949 5.6792 6.3655 1.1994 4.6955 6.3167 5.8011 7.3521 1.2781 4.3930 8.5583 1.4747 4.9463 1.4523 1.3343 1.3410 7.8053 1.3198 4.3182 2.7810 3.7031 1.7744 1.3282 4.6629 1.1061 1.8119 1.6112 2.9553 1.7042 2.7735 7.9368 2.7125 2.8808 2.8266 5.5468 6.3794 6.5197 7.5392 9.2167 1.0875 1.0904 1.0899 1.0969 1.0975 1.0968 1.0823
irintensity: 1.8191 0.2487 1.7751 2.3762 2.2367 2.2628 0.3714 6.1757 3.1008 0.6947 7.2988 11.4247 14.9684 3.1408 140.7029 0.5930 0.4845 0.0565 0.6893 39.4144 13.9412 14.4637 91.9770 6.2140 0.4145 4.7601 2.4489 7.1708 1.4674 10.7879 9.4664 28.6652 17.1213 1.5205 28.1992 2.0683 18.1746 6.5593 10.6668 6.8127 41.3713 0.5421 19.8438 47.2381 9.8620 4.7620 27.5918 28.0966 7.4895 416.0812 2.4858 11.3394 11.1212 18.1684 11.3801 3.6699 125.9835
temp: 298.150 k
press: 1.00000 atm
elementType: 8 7 7 7 6 6 6 6 6 6 6 6 6 6 1 1 1 1 1 1 1
symmnumber: 1
zpe: 406456.7 jmol-1
zpe.correction: 0.154811 hartree
zpe.thermalcorrener: 0.164399 hartree
zpe.thermalcorrenthalpy: 0.165343 hartree
zpe.thermalcorrgfe: 0.119805 hartree
zpe.sumelectzpe: -623.803100 hartree
zpe.sumelectthermal: -623.793512 hartree
zpe.sumelectthermalent: -623.792568 hartree
zpe.sumelectthermalfe: -623.838106 hartree
dipole: 2.2082 2.3191 0.0003
dipole: 3.2022
quadrupole: -68.6486 -79.8585 -84.1440
quadrupole: 1.0746 -0.0012 -0.0008
quadrupole: 8.9018 -2.3081 -6.5937 1.0746 -0.0012 -0.0008
hfenergy: -623.957911 hartree
pointgroup: C01 [X(C10H7N3O1)]
dipole: 0.8495809 -0.9302799 -0.000401 debye
dipolederiv: -0.3952805 -0.0960775 -0.0000427 0.3414822 -1.3352682 -0.0003734 0.0000687 -0.0001716 -0.3625481 -0.9078492 0.2711682 0.0000728 -0.1403976 -0.6833196 -0.0001777 -0.0000355 -0.0002068 -0.0275334 -0.3195508 -0.4132848 -0.0000831 0.5799009 -0.4545978 -0.0000279 0.0001422 -0.0001015 -0.3415738 -0.5339173 0.0022803 0.0000043 -0.5965918 0.0360779 0.0000265 -0.0001465 0.0000632 -0.1763097 0.6105801 -0.0664769 -0.0000642 0.123448 0.0555702 -0.0000218 -0.0000059 -0.0000205 0.0922658 -0.1539298 0.101131 0.0000342 -0.0320356 -0.1353971 -0.0000426 0.0000186 -0.0000543 0.0280115 0.5318211 0.0836604 0.000028 0.25288 0.2041573 0.0000293 0.000049 0.0000783 0.0853816 0.1710081 0.0247261 -0.0000203 0.2325831 0.2000244 0.0000864 0.0000221 0.0001007 -0.1439268 -0.0882016 -0.0526981 -0.0000118 -0.0616536 0.0730166 0.0000623 0.0000119 0.0000527 -0.14984 0.553977 0.1573459 0.0000868 -0.4505402 1.7810983 0.0005605 -0.0000659 0.0004116 0.2575196 -0.1522978 -0.0554117 -0.0000128 -0.0931702 -0.0387479 0.0000349 -0.000022 0.0000242 -0.151957 0.1656761 -0.0393347 -0.0000251 -0.0478387 0.1023667 0.0000733 -0.0000238 0.0000822 -0.1648117 -0.1021264 0.0271944 0.0000077 0.0808405 0.1342146 0.0000801 0.0000366 0.0000909 -0.1515195 0.1013864 0.0207419 -0.0000095 -0.1863971 -0.1389898 0.0000118 -0.0000679 0.000001 -0.1555628 0.0363242 0.1114371 0.0000389 0.0304149 -0.0334089 -0.0000543 0.0000225 -0.0000611 0.1548821 0.0583948 -0.0738452 -0.000016 -0.0200076 0.0054773 -0.0000421 -0.0000057 -0.0000455 0.1738524 0.1291565 0.056075 0.0000182 0.0094755 0.0733287 -0.000029 0.0000038 -0.0000316 0.182515 0.048307 0.0489516 0.0000192 0.1059561 -0.0650123 -0.0000643 0.000029 -0.0000638 0.1552134 0.3464647 -0.0201186 -0.0000199 -0.0252259 0.1817857 -0.0000564 -0.0000169 -0.0000679 0.3738281 0.0324301 -0.076273 -0.0000167 -0.0940003 -0.0568334 -0.0000565 -0.0000296 -0.0000603 0.15711 -0.1323723 -0.0111912 0.0000119 -0.0091225 0.0944572 -0.0000191 0.0000154 -0.0000197 0.1650036 unknown
polarizability: 200.078855|5.7009664|147.3076376|-0.0023731|0.0254596|49.8014031 unknown
InChI: InChI=1S/C10H7N3O/c14-10-12-11-9-6-5-7-3-1-2-4-8(7)13(9)10/h1-6,12H
charge 0 multiplicity 1
21 atoms
O  -1.617998 2.507581 0.000779
N  -0.836835 0.198382 0.000156
N  -3.0056 0.53904 0.000094
N  -2.871854 -0.862212 -0.000231
C  0.57515 0.288643 0.000062
C  1.302068 -0.951044 -0.000297
C  -1.532999 -1.038808 -0.000181
C  0.582697 -2.218114 -0.000576
C  -0.795578 -2.269876 -0.000528
C  -1.802298 1.261333 0.000493
C  1.248161 1.533717 0.000362
C  2.723218 -0.89582 -0.000367
C  2.657503 1.547594 0.000291
C  3.398574 0.337772 -0.000066
H  1.169382 -3.143194 -0.000879
H  -1.358912 -3.205648 -0.000757
H  0.666521 2.458955 0.000637
H  3.287396 -1.835892 -0.00065
H  -3.932771 0.956483 0.000024
H  3.181128 2.509626 0.000546
H  4.493047 0.364682 -0.000115
