program: Gaussian 09
title: 000170509
version: EM64L-G09RevD.01
frameworkgroup: C1[X(C11H13NO4)]
method: RPBEPBE
basis: SDD
operation: Freq
keyword: #p
keyword: freq=noraman
keyword: PBEPBE/SDD
title: #p freq=noraman PBEPBE/SDD
converged: YES YES NO NO
title: Mulliken charges:
elementType: O O O O N C C C C C C C C C C C H H H H H H H H H H H H H
charge: -0.274767 -0.230715 -0.245862 -0.250511 0.040164 0.253257 -0.347585 -0.060438 -0.255451 0.189204 0.212642 -0.222551 -0.360745 -0.227451 -0.669739 -0.668718 0.308710 0.272031 0.233309 0.233274 0.230418 0.230390 0.251632 0.214545 0.233872 0.233881 0.208750 0.234224 0.234229
chargesum: 0.00000
title: Mulliken charges with hydrogens summed into heavy atoms:
elementType: O O O O N C C C C C C C C C C C
charge: -0.274767 -0.230715 -0.245862 -0.250511 0.040164 0.253257 -0.038874 -0.060438 0.016580 0.189204 0.212642 0.244032 -0.109113 0.233356 0.012558 0.008486
polarizability: 2.00601654e+02 -1.87545925e+00 1.55034995e+02 2.01269300e-03 3.21820364e-02 7.50793264e+01
1716.lowfreq: -3.5302 -0.0003 0.0008 0.0009 2.9629 4.4949 17.2831 30.3806 58.4288
frequency: 17.2027 30.0707 58.4269 59.3764 63.5561 92.4485 106.2047 107.3622 178.5734 194.2737 195.2117 250.1690 250.4507 270.8536 289.3814 318.8770 362.6397 376.9014 413.4778 462.4006 485.7604 517.3649 666.7749 672.7710 697.9239 740.8097 769.8369 792.3900 797.5007 797.9664 805.4815 832.0785 886.1483 894.6198 962.5477 976.6041 993.0538 1018.2882 1019.4086 1071.0093 1088.7325 1110.8864 1113.5411 1114.6607 1133.6074 1135.4857 1201.3843 1247.8715 1249.9011 1282.0642 1284.7439 1313.6097 1353.3286 1357.6644 1389.3986 1401.4833 1402.3261 1442.1072 1461.9855 1463.4170 1470.9105 1472.2947 1485.3237 1485.5139 1553.9905 1579.3492 1598.2364 1622.0396 2998.1644 2998.3865 3008.1999 3012.0698 3067.9287 3071.7599 3094.6103 3094.7610 3111.2779 3111.8950 3142.1681 3173.6037 3193.6621
redmass: 3.7008 3.0772 4.0648 3.3500 4.8181 2.8244 2.6738 4.2059 2.5863 5.0060 2.9658 1.4210 1.4254 5.5221 6.3286 4.5423 4.0467 4.8898 3.0896 6.8025 7.4943 5.7459 7.8373 7.0343 9.0126 3.7534 5.2799 6.6033 1.1049 1.1157 4.0475 4.2368 1.4167 5.5961 7.2263 1.4506 1.4265 2.2297 2.2594 3.2575 1.8310 2.9844 2.2442 2.2203 1.4594 1.4672 2.6757 1.1383 1.1325 3.3241 1.6816 8.2539 1.5006 1.4269 3.1659 1.2713 1.3248 2.1410 1.0397 1.0396 1.0670 1.0637 1.0660 1.0676 8.7651 6.1911 10.9279 11.1986 1.0362 1.0360 1.0578 1.0581 1.1069 1.1069 1.0984 1.0984 1.1026 1.1023 1.0899 1.0964 1.0931
irintensity: 1.2644 0.1049 1.0972 1.2704 1.1092 1.4702 1.2216 1.0467 6.3779 5.3351 3.4996 0.0766 4.3795 8.0491 6.5962 9.8367 5.8137 11.4905 1.0657 2.5889 1.8326 1.1679 13.6799 25.5703 18.9868 15.3817 5.7802 0.1573 5.9794 0.8355 4.5843 4.6738 20.7673 56.9499 1.1598 8.8468 0.3868 12.6204 104.2847 174.6249 17.1159 110.1112 1.0249 36.5162 6.0888 6.1181 691.2763 0.0064 0.0382 104.9157 51.1270 10.1371 7.6126 3.5205 23.0124 32.1370 9.0262 13.7541 11.8790 12.9551 4.6693 4.6409 12.6956 14.7106 29.1298 13.8262 134.5689 156.7500 22.5564 16.5290 18.8480 17.4421 10.6416 7.9376 30.5519 26.3347 36.8118 42.0982 16.3061 5.7008 3.6444
temp: 298.150 k
press: 1.00000 atm
elementType: 8 8 8 8 7 6 6 6 6 6 6 6 6 6 6 6 1 1 1 1 1 1 1 1 1 1 1 1 1
symmnumber: 1
zpe: 588506.1 jmol-1
zpe.correction: 0.224150 hartree
zpe.thermalcorrener: 0.240644 hartree
zpe.thermalcorrenthalpy: 0.241588 hartree
zpe.thermalcorrgfe: 0.177175 hartree
zpe.sumelectzpe: -781.428060 hartree
zpe.sumelectthermal: -781.411567 hartree
zpe.sumelectthermalent: -781.410622 hartree
zpe.sumelectthermalfe: -781.475035 hartree
dipole: -0.5217 -1.0700 0.0010
dipole: 1.1904
quadrupole: -76.3150 -92.3855 -92.3980
quadrupole: 5.6620 0.0061 -0.0058
quadrupole: 10.7178 -5.3527 -5.3651 5.6620 0.0061 -0.0058
hfenergy: -781.6522106 hartree
pointgroup: C01 [X(C11H13N1O4)]
dipole: -0.1980461 -0.4244157 0.0003233 debye
polarizability: 200.6523024|-1.0985663|154.9843312|-0.0085083|0.0465368|75.079341 unknown
InChI: InChI=1S/C11H13NO4/c1-3-15-10(13)8-5-6-12-9(7-8)11(14)16-4-2/h5-7H,3-4H2,1-2H3
charge 0 multiplicity 1
29 atoms
O  -2.960357 -0.806587 -0.001693
O  3.417346 -0.19661 -0.001723
O  -3.686964 1.410162 0.000462
O  1.86976 -1.936803 -0.002858
N  1.443844 1.678346 -0.000662
C  -1.29819 0.914323 -0.001645
C  -0.280047 -0.066018 -0.00258
C  1.070294 0.361978 -0.002105
C  -0.927096 2.281265 -0.000163
C  -2.755936 0.567836 -0.002193
C  2.133975 -0.70576 -0.003297
C  -4.388344 -1.260985 0.000122
C  0.447244 2.608936 0.000228
C  4.518118 -1.21348 -0.00106
C  -4.363379 -2.784777 0.00044
C  5.826784 -0.43215 0.000693
H  -0.511951 -1.133121 -0.003743
H  -1.700972 3.054464 0.000605
H  -4.879817 -0.839904 0.895683
H  -4.881922 -0.840306 -0.89447
H  4.39813 -1.851629 0.89328
H  4.399986 -1.850736 -0.896284
H  0.772788 3.654716 0.001367
H  -5.398117 -3.172995 0.001742
H  -3.848843 -3.171957 -0.895131
H  -3.84674 -3.171552 0.894973
H  6.680841 -1.133855 0.001209
H  5.902203 0.209663 -0.893105
H  5.900362 0.208736 0.895308
