program: Gaussian 09
title: 000170580
version: EM64L-G09RevD.01
frameworkgroup: C1[X(C17H23N3O9S)]
method: RPBEPBE
basis: SDD
operation: Freq
keyword: #p
keyword: freq=noraman
keyword: PBEPBE/SDD
title: #p freq=noraman PBEPBE/SDD
converged: YES YES NO NO
title: Mulliken charges:
elementType: S O O O O O O O O O N N N C C C C C C C C C C C C C C C C C H H H H H H H H H H H H H H H H H H H H H H H
charge: 0.184169 -0.234466 -0.141055 -0.255214 -0.220273 -0.392652 -0.239609 -0.411120 -0.249190 -0.239204 -0.164146 -0.452394 -0.644593 0.264176 -0.556096 0.155665 0.167511 0.388461 -0.809364 0.246197 -0.487747 0.123800 -0.566156 -0.529508 -0.368535 -0.343953 -0.188539 0.304282 0.148661 -0.749217 0.327990 0.319145 0.293060 0.308035 0.265166 0.292306 0.217773 0.240743 0.265642 0.203907 0.239393 0.233384 0.249309 0.204575 0.217150 0.256188 0.394740 0.313795 0.279357 0.255976 0.248168 0.250099 0.384208
chargesum: 0.00000
title: Mulliken charges with hydrogens summed into heavy atoms:
elementType: S O O O O O O O O O N N N C C C C C C C C C C C C C C C C C
charge: 0.184169 -0.234466 -0.141055 -0.255214 -0.220273 0.002088 -0.239609 -0.026912 -0.249190 -0.239204 -0.164146 -0.133249 -0.051442 0.264176 -0.228106 0.155665 0.167511 0.388461 -0.208269 0.246197 0.069726 0.123800 -0.107639 0.179434 0.114158 0.077772 0.067649 0.304282 0.148661 0.005026
polarizability: 3.28917506e+02 -4.04338876e+01 2.59091664e+02 -1.67276173e+01 -5.74164965e+00 2.01911141e+02
1716.lowfreq: -16.0691 -9.7536 -4.9727 -1.4473 -0.0001 0.0013 0.0015 4.0741 14.6451
frequency: -15.8976 -4.5328 14.3398 20.4129 27.7176 28.8750 40.0622 45.2295 52.1451 55.8762 63.5480 73.6397 83.7998 85.6107 95.3685 96.5124 115.4955 125.3362 134.7997 143.5432 146.4898 153.5152 165.2930 178.2150 200.3634 212.3835 221.7298 257.8998 264.8216 272.9417 285.9892 287.9374 301.4854 319.2289 331.3962 338.8929 353.5657 390.7616 417.9686 433.6871 451.9368 470.2507 472.3245 496.3522 498.8564 541.1461 544.7849 570.2055 573.7800 584.1911 607.7508 611.7841 615.5639 627.1975 644.2247 648.4109 688.2684 692.0671 715.1045 723.9820 734.2168 741.8054 750.8310 786.8749 793.6976 796.3967 800.8881 846.2632 858.6617 897.2416 905.3159 922.8006 943.5951 953.8293 972.1248 992.2191 1007.1870 1022.5891 1026.7655 1042.6502 1049.8925 1056.1752 1067.4596 1071.0887 1087.3765 1103.3338 1107.7610 1122.3804 1134.8681 1149.2833 1165.5901 1166.7795 1188.8420 1193.4424 1199.7908 1202.3563 1205.9999 1213.4730 1240.9367 1249.5089 1266.4723 1270.7821 1281.4962 1289.5471 1299.3277 1301.2989 1342.1623 1349.6774 1365.0224 1380.1215 1384.4765 1384.7233 1427.6694 1430.4534 1440.5515 1447.2097 1452.0712 1453.7483 1453.9229 1465.0614 1466.4166 1478.2355 1481.5853 1613.4813 1617.4734 1630.1614 1637.9073 1647.5087 1663.2483 1741.1259 2936.8836 2965.8317 2966.0356 2984.8535 2996.9297 3008.2181 3012.4152 3013.9293 3018.4601 3040.5615 3068.5236 3077.5099 3078.0538 3080.1300 3099.2663 3129.0369 3143.5747 3144.4163 3462.1078 3492.6503 3517.4038 3533.7457 3637.5210
redmass: 3.5982 5.8861 7.2427 5.2016 4.9886 7.2373 2.2161 3.1045 2.6878 4.1657 4.5085 4.9700 4.5906 6.1769 2.6563 2.4119 3.4531 3.0836 4.0864 1.4905 3.2732 2.6452 3.2317 4.9196 6.0350 4.5585 6.9843 4.7562 4.8759 6.7748 6.1140 4.2230 4.3872 5.3724 3.6207 4.2560 4.5431 4.6408 5.8304 4.1264 3.6891 3.6960 4.3920 2.5140 4.2225 2.3013 2.1436 1.9124 2.6346 2.9190 2.6632 2.8983 1.6057 1.6160 5.6494 3.6046 5.1998 5.7581 4.3914 6.3293 7.7911 1.6990 2.6416 4.8090 4.4292 5.0450 3.7515 1.7048 1.8701 4.9617 6.9902 4.9080 2.5848 6.4529 6.2753 1.9413 3.9268 2.9631 2.2132 1.6807 2.6624 3.3343 2.8276 2.9157 2.2292 1.6484 1.6355 2.4055 2.0081 1.3360 1.3172 1.7300 2.5514 2.4649 1.7216 1.6947 1.5891 1.8519 1.2828 1.3652 1.5334 1.2458 1.8470 1.3817 1.9490 1.3784 1.4211 1.3740 1.5475 1.7773 2.9608 1.5774 1.1516 1.0976 1.0948 1.0771 1.0606 1.0516 1.0955 1.5934 1.1107 1.0529 1.0873 1.4223 7.9353 9.2995 6.0111 8.8919 3.1431 12.8945 1.0813 1.0375 1.0577 1.0610 1.0586 1.0378 1.0601 1.0646 1.0998 1.1015 1.1047 1.0952 1.1021 1.0911 1.0952 1.1029 1.1020 1.0976 1.0772 1.0468 1.0641 1.0645 1.0984
irintensity: 2.5471 1.5119 0.4074 2.6813 1.8120 0.7996 3.1849 0.3523 0.8334 0.1194 1.6407 2.0715 1.8312 0.6776 2.5880 5.5677 6.9613 1.0438 0.7535 15.1907 2.2824 0.8715 0.4589 3.3026 1.4737 1.4447 0.4593 12.0617 10.9694 3.3491 0.9698 9.0427 11.6767 0.8577 15.6377 1.4255 1.1329 2.1432 29.2625 3.4858 22.3202 8.2619 19.0066 79.4876 3.1954 146.0677 29.9775 5.3982 53.1410 15.3727 48.9407 7.2474 37.5800 219.5412 15.0746 25.0588 8.6908 17.2940 31.3958 20.2007 20.1094 12.1868 13.8117 7.0537 4.4971 17.4079 4.0382 2.6634 3.2603 14.0432 67.9213 77.2314 2.9226 67.0541 11.6999 153.5711 93.5480 117.1894 1.7354 29.3879 226.0546 18.7259 284.3900 30.2555 27.8621 37.5486 9.5072 16.3852 9.3559 40.5791 17.0530 1.6608 301.3224 70.4075 42.6754 30.6203 47.3069 117.5481 20.3395 9.4850 19.2571 1.5532 6.1190 25.7391 59.2952 10.8926 16.7790 6.8781 0.5059 3.8001 103.4727 163.7060 20.6449 21.0944 9.9289 68.6580 31.1891 15.0191 9.2834 604.2017 51.5453 6.8154 11.1903 192.8455 105.9422 163.6168 93.6895 165.0311 116.1511 461.4915 37.3888 50.3822 11.6899 22.6409 30.4734 1.5194 14.8802 5.3223 11.6053 4.2250 44.4792 31.6018 1.0014 9.1996 5.9809 15.5659 8.0820 8.6131 52.4005 13.7051 28.0693 67.4508 17.7822
temp: 298.150 k
press: 1.00000 atm
elementType: 16 8 8 8 8 8 8 8 8 8 7 7 7 6 6 6 6 6 6 6 6 6 6 6 6 6 6 6 6 6 1 1 1 1 1 1 1 1 1 1 1 1 1 1 1 1 1 1 1 1 1 1 1
symmnumber: 1
zpe: 1048277.7 jmol-1
zpe.correction: 0.399268 hartree
zpe.thermalcorrener: 0.430834 hartree
zpe.thermalcorrenthalpy: 0.431778 hartree
zpe.thermalcorrgfe: 0.332168 hartree
zpe.sumelectzpe: -1898.624623 hartree
zpe.sumelectthermal: -1898.593057 hartree
zpe.sumelectthermalent: -1898.592113 hartree
zpe.sumelectthermalfe: -1898.691723 hartree
dipole: 2.4737 -4.4881 1.5311
dipole: 5.3485
quadrupole: -155.5082 -186.3933 -181.1155
quadrupole: 12.9076 26.4654 -3.8439
quadrupole: 18.8308 -12.0543 -6.7765 12.9076 26.4654 -3.8439
hfenergy: -1899.0238909 hartree
pointgroup: C01 [X(C17H23N3O9S1)]
dipole: 1.0089045 -0.2650013 -1.8274983 debye
polarizability: 328.1390073|27.743307|203.4126168|-35.9518019|-4.8968094|258.3686868 unknown
InChI: InChI=1S/C17H23N3O9S/c1-8(21)29-6-9-7-30-16-17(28-2,15(27)20(16)12(9)14(25)26)19-11(22)5-3-4-10(18)13(23)24/h10,16,19,23,25H,3-7,18H2,1-2H3
charge 0 multiplicity 1
53 atoms
S  1.542973 -0.461114 -1.704769
O  -0.326047 -2.5554 1.350048
O  0.41627 0.296131 2.783837
O  6.214935 0.343991 -0.863788
O  -2.904097 -1.070557 1.380281
O  3.300501 -0.132361 3.380098
O  4.3032 1.794098 2.550766
O  -7.756776 1.106693 0.532087
O  6.010698 1.561052 -2.850226
O  -8.174665 -0.958514 -0.440571
N  1.955002 -0.490256 1.056745
N  -1.062725 -0.658168 -0.01874
N  -6.86848 -0.253571 -2.774361
C  -0.002502 -1.309818 0.74275
C  1.399336 -1.328132 -0.023203
C  0.733026 -0.370755 1.794419
C  3.16285 0.231885 1.03238
C  3.850919 0.440421 -0.145764
C  3.397217 -0.095122 -1.4931
C  -2.39085 -0.464147 0.401891
C  5.157994 1.197247 -0.212457
C  3.645452 0.743752 2.356954
C  -3.170675 0.55009 -0.446511
C  -1.04875 -3.51881 0.49481
C  -4.632271 0.109759 -0.681643
C  -5.490725 1.240596 -1.277956
C  -6.913151 0.756892 -1.713591
C  6.589208 0.678789 -2.175403
C  -7.675056 0.186506 -0.515062
C  7.77044 -0.156328 -2.612839
H  1.856521 -2.326667 -0.090581
H  -0.742519 -0.096384 -0.815965
H  3.934534 -1.029194 -1.73559
H  3.633846 0.638231 -2.283717
H  5.042803 2.113094 -0.822991
H  5.559522 1.454368 0.774983
H  -2.663404 0.742166 -1.412619
H  -3.161372 1.507447 0.115166
H  -2.094748 -3.1958 0.363473
H  -0.553347 -3.646117 -0.488702
H  -1.016961 -4.464017 1.056621
H  -4.660538 -0.756392 -1.369497
H  -5.047532 -0.224967 0.287618
H  -5.004561 1.648512 -2.186001
H  -5.599081 2.068975 -0.551346
H  -7.477862 1.663754 -2.025822
H  3.541337 0.264812 4.259823
H  -7.344654 -1.130407 -2.546419
H  -7.02835 0.086348 -3.721769
H  8.69233 0.244723 -2.153839
H  7.872542 -0.114008 -3.706914
H  7.660228 -1.198834 -2.27351
H  -8.236188 0.693006 1.300118
